{"text_format":"1","workbook":"xlsx","n_sheets":32,"sheets":["INSTRUCTIONS","Index to output","SETTINGS","SCENARIOS","EFLOWS","SUMMARY","YEAR","QMAX","QMEAN","QMIN","Q50","Q90","Q10","NO_FLOW_DAYS","HIGH_NUM","HIGH_DUR","LOW_NUM","LOW_DUR","PDC50","BFR","SFR","CV_LOG_DAILY","MONTH_MAX","MONTH_MIN","VAR_MONTH","MONTHQ","MONTH_EVENTS","MONTHLY_QMEAN","BIOPERIODS","100_DAY_STATS","QDAILY","TEMP"],"not_rendered":{"charts":0,"images":0,"macros":1,"external_links":0,"defined_names":2,"comments":4,"pivot_tables":0},"unopened":[],"bounds":{"document_bytes":16777216,"sheet_cells":100000,"rows_first":2000,"rows_last":500,"rows_between":2000,"halvings":0,"cell_chars":16384,"cell_head_chars":4096},"cells_cut":0,"cells_raw":0,"read":"whole","date_system":"1900"}

{"sheet":"INSTRUCTIONS","index":0,"n_rows":8,"n_cols":26,"rows_kept":8,"cut":false,"hidden":false,"merged":[]}
[null,"INSTRUCTIONS"]
["1.","Enter conversion factor for units (if any), minimum number of years and days for processing, and the first month of low-flow years in SETTINGS worksheet."]
["2.","Specify SCENARIOS, confirm environmental flow option (either 0 or 1)."]
["3.","Verify that files names listed in SCENARIOS are correct and in the current directory. "]
["4.","Specify appropriations, environmental flow standards, and additional allocations in EFLOWS worksheet for environmental flow option if selected for any scenario."]
["5.","Run macro from menus or use ctrl+e"]
[]
[null,null,null,null,null,null,null,null,null,null,null,null,null,null,null,null,null,null,null,null,null,null,null,null,null,{"$f":"360*24/43560","v":0.19834710743801653}]

{"sheet":"Index to output","index":1,"n_rows":84,"n_cols":3,"rows_kept":84,"cut":false,"hidden":false,"merged":[]}
["Sheet","Variable","Description with units [ ]"]
["SUMMARY","Years","Number of years in the period of analysis"]
[null,"Mean streamflow","Mean streamflow for the period of analysis [L3/T]"]
[null,"Q01","Streamflow exceeded 1 percent of the time [L3/T]"]
[null,"Q10","Streamflow exceeded 10 percent of the time [L3/T]"]
[null,"Q25","Streamflow exceeded 25 percent of the time [L3/T]"]
[null,"Q50","Streamflow exceeded 50 percent of the time [L3/T]"]
[null,"Q75","Streamflow exceeded 75 percent of the time [L3/T]"]
[null,"Q90","Streamflow exceeded 90 percent of the time [L3/T]"]
[null,"Q99","Streamflow exceeded 99 percent of the time [L3/T]"]
[null,"50th percentile of absolute value of percent daily change","Median absolute value of percent daily change in streamflow for the period of record [fraction of daily streamflow]"]
[null,"Coefficient of variation of daily flows","Standard deviation of daily streamflow divided by mean streamflow [multiples of mean streamflow]"]
[null,"Coefficient of variation of log-transformed daily flows","Coefficient of variation of log transformed daily streamflow"]
[null,"Coefficient of variation of log-transformed annual maximum flow","Coefficient of variation of log transformed annual maximum daily streamflow"]
[null,"Median annual maximum streamflow","Median annual maximum daily streamflow [L3/T]"]
{"$rows_left_out":70}
{"sheet":"SETTINGS","index":2,"n_rows":5,"n_cols":4,"rows_kept":5,"cut":false,"hidden":false,"merged":[]}
["Settings: enter a value into blue cells, B2:B5","Specify option","Default"]
["Units conversion factor: use 0.02832 to convert from cubic feet per second to cubic meters per second; use 1 to keep output units the same as input units",{"$f":"1/35.31","v":2.8320589068252619E-2},{"$f":"1/35.31","v":2.8320589068252619E-2}]
["Minimum number of years in the period of analysis required for each site. Note that if the period of analysis on the settings sheet is less than the minimum number of years, statistics will not be calculated for the site.",1,10,"years"]
["Minimum number of days in each water years for that water year to be included in calculations. For example, if the user wants to include years with up to 10 missing days, then 355 would be entered in B4.",360,365,"days"]
["First month for of year for calculating low flow statistics. Annual low-flow statistics should be calculated for over 12 months beginning with a month unlikely to have low flows. Low flow statistics are commonly calculated based on  climate years starting in April (4), water years starting in October (10), or calendar years starting in January (1); values other than 10 will result in one less annual low flow statistic that the period of analysis.",1,4,"4-April, 10-October, 1-January"]

{"sheet":"SCENARIOS","index":3,"n_rows":3,"n_cols":30,"rows_kept":3,"cut":false,"hidden":false,"merged":[]}
["SCENARIO","FILE NAME FOR STREAMFLOW DATA","START YEAR","END YEAR","NWIS FILE (0-No, 1-Yes)","QMEAN COLUMN NUMBER (6-NWIS daily mean flow, 10-NWIS daily max, min, mean flow)","YEAR COLUMN NUMBER","MONTH COLUMN NUMBER","DAY COLUMN NUMBER","NUMBER OF HEADER LINES","TYPE OF THRESHOLD FOR HIGH FLOW EVENTS (1 - streamflow rate, 2 - exceedence duration expressed as fraction of time that flow is exceeded)","HIGH FLOW THRESHOLD (enter units of streamflow after any conversion or fraction of time exceeded such as 0.1)","TYPE OF THRESHOLD FOR LOW FLOW EVENTS (1 - streamflow rate, 2 - exceedence duration expressed as fraction of time that flow is exceeded)","LOW FLOW THRESHOLD (enter units of streamflow after any conversion or fraction of time exceeded such as 0.9)","ENVIRONMENTAL FLOW CALCULATIONS (0 - No, 1 - Yes; specify details on EFLOWS worksheet)","Bioperiod 1: the starting day of the year for each bioperiod that can represent months, times of the year associated with distinct life stages for biota , irrigation seasons, or other intra-annual patterns; if January, enter 1","Bioperiod 2: if February, then enter 32","Bioperiod 3: if March, then enter 60","Bioperiod 4: if April, then enter 91","Bioperiod 5: if May then enter 121","Bioperiod 6: if June, then enter 152","Bioperiod 7: if July, then enter 182","Bioperd 8: if August, then enter 213","Bioperiod 9: if September, then enter 244","Bioperiod 10: if October, then enter 274","Bioperiod 11: if November, then enter 305","Bioperiod 12: if December, then enter 335","Write daily streamflow to Daily Output worksheet? (0-No, 1-Yes)","Write monthly time series and flow duration files? (0-No, 1-Yes)","START DATE FOR 100-DAY STATISTICS (YYYY-MM-DD)"]
[null,null,null,null,"Enter 0 or 1","Enter column number","Not needed for NWIS files",null,null,null,"Enter 1 or 2",null,"Enter 1 or 2","Enter magnitude or duration","Enter 0 or 1",1,32,60,91,121,152,182,213,244,274,305,335,"Enter 0 or 1","Enter 0 or 1","Optional, enter date (YYYY-MM-DD)"]
["A","12189500.txt",1996,2000,0,6,3,4,5,0,2,0.1,2,0.9,0,null,null,null,null,null,null,null,null,null,null,null,null,1,0,"1995-10-01"]

{"sheet":"EFLOWS","index":4,"n_rows":2,"n_cols":43,"rows_kept":2,"cut":false,"hidden":false,"merged":[]}
["SCENARIO","FILE NAME FOR STREAMFLOW DATA","START YEAR","END YEAR","PRIORITY ALLOCATION BASIS:  an integer code corresponding to a streamflow statistic that provides a basis for environmental flow standard:  \n0 - no priority allocation; \n1 - daily streamflow; \n2 - mean streamflow; \n3 - streamflow exceeded for specified fraction of period of analysis; \n4 - flow exceeded for specified fraction of each bioperiod; \n5 - mean streamflow for bioperiod; \n6 -10th percentile of the annual series of 7-day minimum streamflow (estimate of 10-year, 7-day low flow or \"7Q10\"); or \n7 - fixed amount to be entered into each month.","PRIORITY ALLOCATION IN BIOPERIOD 1: Fraction of the streamflow statistic specified in previous column or fixed rate for the priority allocation for bioperiod 1","Priority allocation in bioperiod 2","Priority allocation in bioperiod 3","Priority allocation in bioperiod 4","Priority allocation in bioperiod 5","Priority allocation in bioperiod 6","Priority allocation in bioperiod 7","Priority allocation in bioperiod 8","Priority allocation in bioperiod 9","Priority allocation in bioperiod 10","Priority allocation in bioperiod 11","Priority allocation in bioperiod 12","ENVIRONMENTAL FLOW BASIS:  an integer code corresponding to a streamflow statistic that provides a basis for environmental flow standard:  \n0 - no environmental flow standard; \n1 - daily streamflow; \n2 - mean streamflow; \n3 - streamflow exceeded for specified fraction of period of analysis; \n4 - flow exceeded for specified fraction of each bioperiod;\n5 - mean streamflow for bioperiod; \n6 -10th percentile of the annual series of 7-day minimum streamflow (estimate of 10-year, 7-day low flow or \"7Q10\"); or \n7 - fixed amount to be entered into each bioperiod.","ENVIRONMENTAL FLOW STANDARD IN BIOPERIOD 1: Fraction of the streamflow statistic specified in previous column or fixed rate for the environmental flow standard for bioperiod 1","Environmental flow standard in bioperiod 2","Environmental flow standard in bioperiod 3","Environmental flow standard in bioperiod 4","Environmental flow standard in bioperiod 5","Environmental flow standard in bioperiod 6","Environmental flow standard in bioperiod 7","Environmental flow standard in bioperiod 8","Environmental flow standard in bioperiod 9","Environmental flow standard in bioperiod 10","Environmental flow standard in bioperiod 11","Environmental flow standard in bioperiod 12","ADDITIONAL ALLOCATION BASIS: an integer code corresponding to a statistic used for additional allocation above prior appropriation:  \n0 - no additional allocation; \n1 - daily streamflow; \n2 - mean streamflow; \n3 - streamflow exceeded for specified fraction of period of analysis; \n4 - flow exceeded for specified fraction of each bioperiod; \n5 - mean streamflow for bioperiod; \n6 -10th percentile of the annual series of 7-day minimum streamflow (estimate of 10-year, 7-day low flow or \"7Q10\"); or \n7 - fixed amount to be entered into each bioperiod.","ADDITIONAL ALLOCATION: Fraction of statistic used for additional out-of-stream allocation or fixed amount of out-stream allocation for each bioperiod.","Additional allocation in bioperiod 2","Additional allocation in bioperiod 3","Additional allocation in bioperiod 4","Additional allocation in bioperiod 5","Additional allocation in bioperiod 6","Additional allocation in bioperiod 7","Additional allocation in bioperiod 8","Additional allocation in bioperiod 9","Additional allocation in bioperiod 10","Additional allocation in bioperiod 11","Additional allocation in bioperiod 12"]
[{"$f":"SCENARIOS!A2","v":0},{"$f":"SCENARIOS!B2","v":0},{"$f":"SCENARIOS!C2","v":0},{"$f":"SCENARIOS!D2","v":0},"Enter 0, 1, 2, 3, 4, 5, 6, or 7","Enter fraction or fixed rate",null,null,null,null,null,null,null,null,null,null,null,"Enter 0, 1, 2, 3, 4, 5, 6, or 7","Enter fraction or fixed rate",null,null,null,null,null,null,null,null,null,null,null,"Enter 0, 1, 2, 3, 4, 5, 6, or 7","Enter fraction or fixed rate"]

{"sheet":"SUMMARY","index":5,"n_rows":3,"n_cols":39,"rows_kept":3,"cut":false,"hidden":false,"merged":[]}
["SCENARIO","Years","Mean streamflow","Q01","Q10","Q25","Q50","Q75","Q90","Q99","50th percentile of absolute value of percent daily change","Coefficient of variation of daily flows","Coefficient of variation of log-transformed daily flows","Coefficient of variation of log-transformed annual maximum flow","Median annual maximum streamflow","Qmax/Q50","Median annual number of high-flow events","Median duration of the annual longest high-flow event","Number of months with annual probability >0.5 of having a high-flow event","Mode of highest streamflow month","Median annual minimum streamflow","Qmin/Q50","Coefficient of variation of annual minimum streamflow","Median annual number of low-flow periods","Median duration of the annual longest low-flow period","Number of months with annual probability >0.5 of having a low-flow period","Mode of lowest flow month","Fraction of years with no-flow days","Mean number of no-flow days in years with no-flow days","Coefficient of variation of annual mean streamflow","Storm-flow recession coefficient (SFR)","Base-flow recession coefficient (BFR)","Maximum monthly streamflow","Minimum monthly streamflow","Maximum CV of monthly streamflow","Minimum CV of monthly streamflow","Normalized range of monthly streamflow","LOG(Q10/Q90)","Hydroperiod"]
[null,null,null,null,null,null,null,null,null,null,null,null,null,null,{"$f":"IF(COUNT(QMAX!B2:GS2)>0,MEDIAN(QMAX!B2:GS2),\"NA\")","v":"NA"},{"$f":"IF(G2>0,O2/G2,\"NA\")","v":"NA"},{"$f":"IF(COUNT(HIGH_NUM!B2:GS2)>0,MEDIAN(HIGH_NUM!$B2:$GS2),\"NA\")","v":"NA"},{"$f":"IF(COUNT(HIGH_DUR!B2:GS2)>0,MEDIAN(HIGH_DUR!$B2:$GS2),\"NA\")","v":"NA"},{"$f":"IF(COUNT(MONTH_EVENTS!O2:Z2)>0,COUNTIF(MONTH_EVENTS!O2:Z2,\">0.5\"),\"NA\")","v":"NA"},{"$f":"IF(COUNT(MONTH_MAX!B2:GS2)>1,MODE(MONTH_MAX!B2:GS2),\"NA\")","v":"NA"},{"$f":"IF(COUNT(QMIN!B2:GS2)>0,MEDIAN(QMIN!B2:GS2),\"NA\")","v":"NA"},{"$f":"IF(G2>0,U2/G2,\"NA\")","v":"NA"},{"$f":"IF(COUNT(QMIN!B2:GS2)>1,STDEV(QMIN!B2:GS2)/AVERAGE(QMIN!B2:GS2),\"NA\")","v":"NA"},{"$f":"IF(COUNT(LOW_NUM!B2:GS2)>0,MEDIAN(LOW_NUM!$B2:$GS2),\"NA\")","v":"NA"},{"$f":"IF(COUNT(LOW_DUR!B2:G2)>0,MEDIAN(LOW_DUR!$B2:$GS2),\"NA\")","v":"NA"},{"$f":"IF(COUNT(MONTH_EVENTS!A2:AZ2)>0,COUNTIF(MONTH_EVENTS!AO2:AZ2,\">0.5\"),\"NA\")","v":"NA"},{"$f":"IF(COUNT(MONTH_MIN!B2:GS2)>1,MODE(MONTH_MIN!B2:GS2),\"NA\")","v":"NA"},{"$f":"IF(COUNT(NO_FLOW_DAYS!B2:GS2)>0,COUNTIF(NO_FLOW_DAYS!B2:GS2,\">0\")/B2,\"NA\")","v":"NA"},{"$f":"IF(ISNUMBER(SUMMARY!AB2),IF(AB2>0,SUM(NO_FLOW_DAYS!B2:GS2)/COUNTIF(NO_FLOW_DAYS!B2:GS2,\">0\"),0),\"NA\")","v":"NA"},{"$f":"IF(COUNT(QMEAN!B2:GS2)>1,STDEV(QMEAN!B2:GS2)/SUMMARY!C2,\"NA\")","v":"NA"},{"$f":"IF(COUNT(SFR!B2:GS2)>0,MEDIAN(SFR!B2:GS2),\"NA\")","v":"NA"},{"$f":"IF(COUNT(BFR!B2:GS2)>0,MEDIAN(BFR!B2:GS2),\"NA\")","v":"NA"},{"$f":"IF(COUNT(MONTHQ!B2:M2)>0,MAX(MONTHQ!B2:M2),\"NA\")","v":"NA"},{"$f":"IF(COUNT(MONTHQ!B2:M2)>0,MIN(MONTHQ!B2:M2),\"NA\")","v":"NA"},{"$f":"IF(COUNT(MONTHQ!O2:Z2)>0,MAX(MONTHQ!O2:Z2),\"NA\")","v":"NA"},{"$f":"IF(COUNT(MONTHQ!O2:Z2)>0,MIN(MONTHQ!O2:Z2),\"NA\")","v":"NA"},{"$f":"IF(COUNT(VAR_MONTH!B2:GS2)>0,MEDIAN(VAR_MONTH!B2:GS2),\"NA\")","v":"NA"},{"$f":"IF(I2>0,LOG(E2/I2),\"NA\")","v":"NA"},{"$f":"IF(ISNUMBER(AB2),1-AB2*AC2/365,\"NA\")","v":"NA"}]
["12189500.txt_A",5,141.13107503374977,570.71651090342675,260.91758708581136,171.97677711696403,112.00792976493911,69.597847635230806,48.99461908807703,28.680260549419422,8.782742681047756E-2,0.83423784724335059,0.45553895135986489,0.28449935644995489,{"$f":"IF(COUNT(QMAX!B3:GS3)>0,MEDIAN(QMAX!B3:GS3),\"NA\")","v":880.77032002265651},{"$f":"IF(G3>0,O3/G3,\"NA\")","v":7.8634639696586603},{"$f":"IF(COUNT(HIGH_NUM!B3:GS3)>0,MEDIAN(HIGH_NUM!$B3:$GS3),\"NA\")","v":10},{"$f":"IF(COUNT(HIGH_DUR!B3:GS3)>0,MEDIAN(HIGH_DUR!$B3:$GS3),\"NA\")","v":11},{"$f":"IF(COUNT(MONTH_EVENTS!O3:Z3)>0,COUNTIF(MONTH_EVENTS!O3:Z3,\">0.5\"),\"NA\")","v":6},{"$f":"IF(COUNT(MONTH_MAX!B3:GS3)>1,MODE(MONTH_MAX!B3:GS3),\"NA\")","v":11},{"$f":"IF(COUNT(QMIN!B3:GS3)>0,MEDIAN(QMIN!B3:GS3),\"NA\")","v":31.435853865760407},{"$f":"IF(G3>0,U3/G3,\"NA\")","v":0.2806573957016435},{"$f":"IF(COUNT(QMIN!B3:GS3)>1,STDEV(QMIN!B3:GS3)/AVERAGE(QMIN!B3:GS3),\"NA\")","v":0.32890691930582122},{"$f":"IF(COUNT(LOW_NUM!B3:GS3)>0,MEDIAN(LOW_NUM!$B3:$GS3),\"NA\")","v":6},{"$f":"IF(COUNT(LOW_DUR!B3:G3)>0,MEDIAN(LOW_DUR!$B3:$GS3),\"NA\")","v":11},{"$f":"IF(COUNT(MONTH_EVENTS!A3:AZ3)>0,COUNTIF(MONTH_EVENTS!AO3:AZ3,\">0.5\"),\"NA\")","v":3},{"$f":"IF(COUNT(MONTH_MIN!B3:GS3)>1,MODE(MONTH_MIN!B3:GS3),\"NA\")","v":10},{"$f":"IF(COUNT(NO_FLOW_DAYS!B3:GS3)>0,COUNTIF(NO_FLOW_DAYS!B3:GS3,\">0\")/B3,\"NA\")","v":0},{"$f":"IF(ISNUMBER(SUMMARY!AB3),IF(AB3>0,SUM(NO_FLOW_DAYS!B3:GS3)/COUNTIF(NO_FLOW_DAYS!B3:GS3,\">0\"),0),\"NA\")","v":0},{"$f":"IF(COUNT(QMEAN!B3:GS3)>1,STDEV(QMEAN!B3:GS3)/SUMMARY!C3,\"NA\")","v":0.15571630637298231},{"$f":"IF(COUNT(SFR!B3:GS3)>0,MEDIAN(SFR!B3:GS3),\"NA\")","v":-0.22496373780707737},{"$f":"IF(COUNT(BFR!B3:GS3)>0,MEDIAN(BFR!B3:GS3),\"NA\")","v":-8.1608406090927996E-2},{"$f":"IF(COUNT(MONTHQ!B3:M3)>0,MAX(MONTHQ!B3:M3),\"NA\")","v":233.08222411026154},{"$f":"IF(COUNT(MONTHQ!B3:M3)>0,MIN(MONTHQ!B3:M3),\"NA\")","v":56.758614179174934},{"$f":"IF(COUNT(MONTHQ!O3:Z3)>0,MAX(MONTHQ!O3:Z3),\"NA\")","v":0.5881108561254591},{"$f":"IF(COUNT(MONTHQ!O3:Z3)>0,MIN(MONTHQ!O3:Z3),\"NA\")","v":0.23530548241463575},{"$f":"IF(COUNT(VAR_MONTH!B3:GS3)>0,MEDIAN(VAR_MONTH!B3:GS3),\"NA\")","v":1.6013302999126664},{"$f":"IF(I3>0,LOG(E3/I3),\"NA\")","v":0.72635496803393595},{"$f":"IF(ISNUMBER(AB3),1-AB3*AC3/365,\"NA\")","v":1}]

{"sheet":"YEAR","index":6,"n_rows":3,"n_cols":6,"rows_kept":3,"cut":false,"hidden":false,"merged":[]}
[]
[]
["12189500.txt_A",1996,1997,1998,1999,2000]

{"sheet":"QMAX","index":7,"n_rows":3,"n_cols":6,"rows_kept":3,"cut":false,"hidden":false,"merged":[]}
[]
[]
["12189500.txt_A",1710.5635797224581,880.77032002265651,668.36590201076183,600.39648824695553,1141.3197394505805]

{"sheet":"QMEAN","index":8,"n_rows":3,"n_cols":6,"rows_kept":3,"cut":false,"hidden":false,"merged":[]}
[]
[]
["12189500.txt_A",160.32161665683955,164.92747213525607,112.70135744850896,140.28242998413273,127.40752089610669]

{"sheet":"QMIN","index":9,"n_rows":3,"n_cols":6,"rows_kept":3,"cut":false,"hidden":false,"merged":[]}
[]
[]
["12189500.txt_A",34.834324553950722,51.543472104219767,26.224865477201924,23.449447748513169,31.435853865760407]

{"sheet":"Q50","index":10,"n_rows":3,"n_cols":6,"rows_kept":3,"cut":false,"hidden":false,"merged":[]}
[]
[]
["12189500.txt_A",124.61059190031152,131.12432738600964,93.316340979892374,110.30869442084395,108.18465024072501]

{"sheet":"Q90","index":11,"n_rows":3,"n_cols":6,"rows_kept":3,"cut":false,"hidden":false,"merged":[]}
[]
[]
["12189500.txt_A",56.471254602095712,67.261399037099963,40.073633531577457,39.507221750212402,47.068819031435844]

{"sheet":"Q10","index":12,"n_rows":3,"n_cols":6,"rows_kept":3,"cut":false,"hidden":false,"merged":[]}
[]
[]
["12189500.txt_A",299.06542056074761,311.52647975077883,194.84565278957803,273.2936845086378,238.006230529595]

{"sheet":"NO_FLOW_DAYS","index":13,"n_rows":3,"n_cols":6,"rows_kept":3,"cut":false,"hidden":false,"merged":[]}
[]
[]
["12189500.txt_A",0,0,0,0,0]

{"sheet":"HIGH_NUM","index":14,"n_rows":3,"n_cols":6,"rows_kept":3,"cut":false,"hidden":false,"merged":[]}
[]
[]
["12189500.txt_A",10,11,5,15,8]

{"sheet":"HIGH_DUR","index":15,"n_rows":3,"n_cols":6,"rows_kept":3,"cut":false,"hidden":false,"merged":[]}
[]
[]
["12189500.txt_A",12,11,7,13,8]

{"sheet":"LOW_NUM","index":16,"n_rows":3,"n_cols":6,"rows_kept":3,"cut":false,"hidden":false,"merged":[]}
[]
[]
["12189500.txt_A",7,0,5,6,7]

{"sheet":"LOW_DUR","index":17,"n_rows":3,"n_cols":6,"rows_kept":3,"cut":false,"hidden":false,"merged":[]}
[]
[]
["12189500.txt_A",11,0,53,17,8]

{"sheet":"PDC50","index":18,"n_rows":3,"n_cols":6,"rows_kept":3,"cut":false,"hidden":false,"merged":[]}
[]
[]
["12189500.txt_A",9.3213423744397089E-2,8.9041095890410926E-2,7.8341013824884856E-2,9.2814371257485026E-2,9.3549962407864035E-2]

{"sheet":"BFR","index":19,"n_rows":3,"n_cols":6,"rows_kept":3,"cut":false,"hidden":false,"merged":[]}
[]
[]
["12189500.txt_A",-8.6285266457680268E-2,-7.8651685393258494E-2,-7.5085324232081821E-2,-8.3874458874458824E-2,-8.1608406090927996E-2]

{"sheet":"SFR","index":20,"n_rows":3,"n_cols":6,"rows_kept":3,"cut":false,"hidden":false,"merged":[]}
[]
[]
["12189500.txt_A",-0.2180887388473596,-0.23123732251521303,-0.17034334637676893,-0.22496373780707737,-0.23216890156918685]

{"sheet":"CV_LOG_DAILY","index":21,"n_rows":3,"n_cols":6,"rows_kept":3,"cut":false,"hidden":false,"merged":[]}
[]
[]
["12189500.txt_A",0.4499887012098861,0.40765771493640907,0.41034080666119355,0.50850470076411258,0.44584811435549981]

{"sheet":"MONTH_MAX","index":22,"n_rows":3,"n_cols":6,"rows_kept":3,"cut":false,"hidden":false,"merged":[]}
[]
[]
["12189500.txt_A",11,3,10,12,11]

{"sheet":"MONTH_MIN","index":23,"n_rows":3,"n_cols":6,"rows_kept":3,"cut":false,"hidden":false,"merged":[]}
[]
[]
["12189500.txt_A",10,9,11,10,9]

{"sheet":"VAR_MONTH","index":24,"n_rows":3,"n_cols":6,"rows_kept":3,"cut":false,"hidden":false,"merged":[]}
[]
[]
["12189500.txt_A",2.2856562302416612,1.2294085042659229,1.3903858037084225,1.6639754332274153,1.6013302999126664]

{"sheet":"MONTHQ","index":25,"n_rows":3,"n_cols":39,"rows_kept":3,"cut":false,"hidden":false,"merged":[]}
[null,"Mean monthly streamflow",null,null,null,null,null,null,null,null,null,null,null,null,"CV annual monthly mean streamflow",null,null,null,null,null,null,null,null,null,null,null,null,"Median annual monthly mean streamflow"]
[null,"October","November","December","January","February","March","April","May","June","July","August","September",null,"October","November","December","January","February","March","April","May","June","July","August","September",null,"October","November","December","January","February","March","April","May","June","July","August","September"]
["12189500.txt_A",108.75215830295721,207.27858019446802,155.88931217511259,149.10516074218214,121.81222472875712,101.76227149395676,112.38176154064006,183.05697919807054,233.08222411026154,177.31064031938314,85.842446168041576,56.758614179174934,null,0.53088273191101099,0.5881108561254591,0.34018629766081177,0.31972597160060828,0.54012063313617475,0.45820428221719484,0.23530548241463575,0.30208300209443556,0.2760559919450114,0.35842054335944812,0.43585015753001582,0.44431747767037588,null,96.774193548387117,140.6589257056547,171.93338266597235,160.85181023378189,103.94667637658291,88.140981719516574,125.3752478051543,167.11888252436941,260.76654394411401,155.79064689706831,73.067119796091788,49.70263381478334]

{"sheet":"MONTH_EVENTS","index":26,"n_rows":3,"n_cols":52,"rows_kept":3,"cut":false,"hidden":false,"merged":[]}
[null,"MEDHIGHDUR",null,null,null,null,null,null,null,null,null,null,null,null,"FRACTION OF YEARSWITHHIGHFLOWEVENTS",null,null,null,null,null,null,null,null,null,null,null,null,"MEDLOWDUR",null,null,null,null,null,null,null,null,null,null,null,null,"FRACTION OF YEARSWITHLOWFLOWEVENTS"]
[null,"October","November","December","January","February","March","April","May","June","July","August","September",null,"October","November","December","January","February","March","April","May","June","July","August","September",null,"October","November","December","January","February","March","April","May","June","July","August","September",null,"October","November","December","January","February","March","April","May","June","July","August","September"]
["12189500.txt_A",1,4,6,2,0,0,0,3,14,0,0,0,null,0.6,1,1,0.6,0.4,0.2,0.4,0.8,0.6,0.4,0,0.2,null,9,0,0,0,0,0,0,0,0,0,3,17,null,0.6,0.2,0,0.2,0.2,0.4,0.2,0,0,0,0.6,0.8]

{"sheet":"MONTHLY_QMEAN","index":27,"n_rows":3,"n_cols":61,"rows_kept":3,"cut":false,"hidden":false,"merged":[]}
[]
[]
["12189500.txt_A",140.41530773517505,416.14273576890395,218.38828441179965,179.30587149761101,232.4534419281438,89.748860324681843,127.66921551968284,124.37306437909393,155.33843103936564,135.09834552945799,63.346762773956009,49.70263381478334,96.774193548387117,126.64023411686961,97.13048483021349,200.61026301605136,125.9254763927661,183.44433177113311,140.47012177853304,273.94231735503968,299.53743037855196,231.0411927535834,100.83956843076528,99.197583309732849,189.95806725683121,140.6589257056547,104.53951635742406,124.97601885603092,78.043451875227575,81.618110559925455,81.289530822241119,183.33470368441726,173.89785707542723,108.2394642840829,48.546971067320776,33.259699801755879,42.444340906806985,137.88445199660154,171.93338266597235,160.85181023378189,103.94667637658291,88.140981719516574,87.104691777588968,166.51592804743242,275.87085811384878,256.38355213272308,143.41180877207407,44.888133673180405,74.168882067585727,215.06655338431037,187.45489261015345,79.781840107435542,68.692077071065142,65.859073094526835,125.3752478051543,167.11888252436941,260.76654394411401,155.79064689706831,73.067119796091788,56.745020296422162]

{"sheet":"BIOPERIODS","index":28,"n_rows":3,"n_cols":28,"rows_kept":3,"cut":false,"hidden":false,"merged":[]}
[null,"Priority allocation",null,null,null,null,null,null,null,null,null,null,null,null,"Environmental flow standard",null,null,null,null,null,null,null,null,null,null,null,null,"Additional allocation allowed"]
["Bioperiod",1,2,3,4,5,6,7,8,9,10,11,12,null,1,2,3,4,5,6,7,8,9,10,11,12]
["12189500.txt_A"]

{"sheet":"100_DAY_STATS","index":29,"n_rows":3,"n_cols":7,"rows_kept":3,"cut":false,"hidden":false,"merged":[]}
["Streamflow statistics for 100 days prior to date listed on scenario sheet","Mean streamflow","Maximum streamflow","Minimum streamflow","Duration of high flows","Duration of low flows","Percent daily change"]
[]
["12189500.txt_A",257.93542905692436,1710.5635797224581,57.207589917870287,36,0,1.7195312500000001E-2]

{"sheet":"QDAILY","index":30,"n_rows":1828,"n_cols":2,"rows_kept":1828,"cut":false,"hidden":false,"merged":[]}
["DATE","12189500.txt_A"]
["1995-10-01",86.66100254885302]
["1995-10-02",64.004531294250924]
["1995-10-03",131.40753327669216]
["1995-10-04",120.07929764939111]
["1995-10-05",78.448031719059756]
["1995-10-06",62.305295950155759]
["1995-10-07",57.207589917870287]
["1995-10-08",60.606060606060602]
["1995-10-09",66.836590201076177]
["1995-10-10",320.02265647125461]
["1995-10-11",275.27612574341543]
["1995-10-12",209.85556499575191]
["1995-10-13",156.04644576607194]
["1995-10-14",133.38997451146983]
{"$rows_left_out":1814}
{"sheet":"TEMP","index":31,"n_rows":0,"n_cols":0,"rows_kept":0,"cut":false,"hidden":false,"merged":[]}