{"text_format":"1","workbook":"xlsx","n_sheets":32,"sheets":["INSTRUCTIONS","Index to output","SETTINGS","SCENARIOS","EFLOWS","SUMMARY","YEAR","QMAX","QMEAN","QMIN","Q50","Q90","Q10","NO_FLOW_DAYS","HIGH_NUM","HIGH_DUR","LOW_NUM","LOW_DUR","PDC50","BFR","SFR","CV_LOG_DAILY","MONTH_MAX","MONTH_MIN","VAR_MONTH","MONTHQ","MONTH_EVENTS","MONTHLY_QMEAN","BIOPERIODS","100_DAY_STATS","QDAILY","TEMP"],"not_rendered":{"charts":0,"images":0,"macros":1,"external_links":0,"defined_names":2,"comments":4,"pivot_tables":0},"unopened":[],"bounds":{"document_bytes":16777216,"sheet_cells":100000,"rows_first":2000,"rows_last":500,"rows_between":2000,"halvings":0,"cell_chars":16384,"cell_head_chars":4096},"cells_cut":0,"cells_raw":0,"read":"whole","date_system":"1900"}

{"sheet":"INSTRUCTIONS","index":0,"n_rows":8,"n_cols":26,"rows_kept":8,"cut":false,"hidden":false,"merged":[]}
[null,"INSTRUCTIONS"]
["1.","Enter conversion factor for units (if any), minimum number of years and days for processing, and the first month of low-flow years in SETTINGS worksheet."]
["2.","Specify SCENARIOS, confirm environmental flow option (either 0 or 1)."]
["3.","Verify that files names listed in SCENARIOS are correct and in the current directory. "]
["4.","Specify appropriations, environmental flow standards, and additional allocations in EFLOWS worksheet for environmental flow option if selected for any scenario."]
["5.","Run macro from menus or use ctrl+e"]
[]
[null,null,null,null,null,null,null,null,null,null,null,null,null,null,null,null,null,null,null,null,null,null,null,null,null,{"$f":"360*24/43560","v":0.19834710743801653}]

{"sheet":"Index to output","index":1,"n_rows":84,"n_cols":3,"rows_kept":84,"cut":false,"hidden":false,"merged":[]}
["Sheet","Variable","Description with units [ ]"]
["SUMMARY","Years","Number of years in the period of analysis"]
[null,"Mean streamflow","Mean streamflow for the period of analysis [L3/T]"]
[null,"Q01","Streamflow exceeded 1 percent of the time [L3/T]"]
[null,"Q10","Streamflow exceeded 10 percent of the time [L3/T]"]
[null,"Q25","Streamflow exceeded 25 percent of the time [L3/T]"]
[null,"Q50","Streamflow exceeded 50 percent of the time [L3/T]"]
[null,"Q75","Streamflow exceeded 75 percent of the time [L3/T]"]
[null,"Q90","Streamflow exceeded 90 percent of the time [L3/T]"]
[null,"Q99","Streamflow exceeded 99 percent of the time [L3/T]"]
[null,"50th percentile of absolute value of percent daily change","Median absolute value of percent daily change in streamflow for the period of record [fraction of daily streamflow]"]
[null,"Coefficient of variation of daily flows","Standard deviation of daily streamflow divided by mean streamflow [multiples of mean streamflow]"]
[null,"Coefficient of variation of log-transformed daily flows","Coefficient of variation of log transformed daily streamflow"]
[null,"Coefficient of variation of log-transformed annual maximum flow","Coefficient of variation of log transformed annual maximum daily streamflow"]
[null,"Median annual maximum streamflow","Median annual maximum daily streamflow [L3/T]"]
[null,"Qmax/Q50","Median annual maximum daily streamflow divided by median streamflow"]
[null,"Median annual number of high-flow events","Median annual number of times that streamflow exceeds the specified high-flow threshold [events per year]"]
[null,"Median duration of the annual longest high-flow event","Median annual duration of the longest high flow period [days]"]
[null,"Number of months with annual probability >0.5 of having a high-flow event","Number of months with daily flow exceeding the high-flow threshold in more than half of the years in the period for analysis [number of months, maximum of 12]"]
[null,"Mode of highest streamflow month","Most common month of maximum monthly mean flow"]
[null,"Median annual minimum streamflow","Median annual miniimum daily streamflow [L3/T]"]
[null,"Qmin/Q50","Median annual miniimum daily streamflow divided by median streamflow"]
[null,"Coefficient of variation of annual minimum streamflow","Coefficient of variation of annual minimum daily streamflow"]
[null,"Median annual number of low-flow periods","Median annual number of times that streamflow is less the specified low-flow threshold [events per year]"]
[null,"Median duration of the annual longest low-flow period","Median annual duration of the longest low-flow period [days]"]
[null,"Number of months with annual probability >0.5 of having a low-flow period","Number of months with daily flows less than the low-flow threshold in more than half of the years in the period for analysis [number of months,maximum of 12]"]
[null,"Mode of lowest flow month","Most common month of minimum monthly mean flow"]
[null,"Fraction of years with no-flow days","Fraction of years in the period of record with one or more days when flow was equal to zero"]
[null,"Mean number of no-flow days in years with no-flow days","Mean number of days when flow was equal to zero for years with no-flow days"]
[null,"Coefficient of variation of annual mean streamflow","Standard deviation of annual mean streamflow divided  by mean streamflow [multiples of mean streamflow]"]
[null,"Storm-flow recession coefficient (SFR)","Median annual value of the 10th percentile of percent daily change for days when change in flow was less than or equal to zero"]
[null,"Base-flow recession coefficient (BFR)","Median annual value of the 50th percentile of percent daily change for days when change in flow as less than or equal to zero"]
[null,"Maximum monthly streamflow","Maximum of monthly mean streamflow"]
[null,"Minimum monthly streamflow","Minimum of monthly mean streamflow"]
[null,"Maximum CV of monthly streamflow","Maximum coefficient of varation of annual monthly mean streamflow (e.g., annual values of October mean streamflow)"]
[null,"Minimum CV of monthly streamflow","Minimum coefficient of varation of annual monthly mean streamflow (e.g., annual values of October mean streamflow)"]
[null,"Normalized range of monthly streamflow","Median annual difference between maximum monthly mean flow and minimum monthly mean flow divided by mean flow"]
[null,"LOG(Q10/Q90)","Logarthim (base 10) of Q10/Q90"]
[null,"Hydroperiod","Fraction of days with flow greater than zero"]
[]
["Sheets with annual values of each streamflow statistic",null,"All of these are annual values, corresponding year can be found on the same line in the sheet \"YEAR\""]
["YEAR",null,"Water year index, the row and column of annual statistics on other sheets reference the water year in the same row and column on this sheet [WATER YEAR]"]
["QMAX",null,"Maximum streamflow [L3/T]"]
["QMEAN",null,"Mean streamflow [L3/T]"]
["QMIN",null,"Minimum daily streamflow [L3/T]"]
["NO_FLOW_DAYS",null,"Number of days with no flow [days]"]
["HIGH_NUM",null,"Number of high streamflow events (continuous periods exceeding high flow threshold) [number of events per year]"]
["HIGH_DUR",null,"Longest duration of a high flow  [days]"]
["LOW_NUM",null,"Number of low flow periods"]
["LOW_DUR",null,"Longest duration of a low flow period [days]"]
["PDC50",null,"Median percent daily change in streamflow [fraction]"]
["SFR",null,"10th percentile of percent daily change for days when change in flow was less than or equal to zero"]
["BFR",null,"50tyh percentile of percent daily change for days when change in flow as less than or equal to zero"]
["CV_LOG_DAILY",null,"Coefficient of variation calculated from log transformed values [dimensionless]"]
["MONTH MAX",null,"Month of maximum daily flow"]
["MONTH MIN",null,"Month of minimum daily flow"]
["VAR_MONTH",null,"Range of log-transformed mean monthly flow [log(L3/T)]"]
[]
["Sheets with monthly summary statistics"]
["MONTHQ",null,"Monthly mean streamflows (e.g., mean of all daily streamflow in October ) [L3/T]"]
[null,null,"Coefficient of variation of annual monthly mean streamflow (e.g., cv of annual values of October mean streamflow)"]
[null,null,"Median of monthly streamflow (e.g., the median of the annual values of mean streamflow for each October in the period of analysis) [L3/T]"]
["MONTH_EVENTS","MEDHIGHDUR","The median annual total duration of high flows in each month"]
[null,"FRACTION OF YEARSWITHHIGHFLOWEVENTS","The fraction of years with high flow events in each month"]
[null,"MEDLOWDUR","The median annual total duration of low flows in each month"]
[null,"FRACTION OF YEARSWITHLOWFLOWEVENTS","The fraction of years with low flow events in each month"]
["MONTHLY QMEAN",null,"A time series of monthly mean flows for each month in the period of analysis."]
[]
["Other sheets"]
["BIOPERIODS","Environmental flow standard by bioperiod","Maximum flow rate that is protected in each bioperiod (does not apply to standards based on a percent of daily flow)"]
[null,"Additional allocation by bioperiod","Flow rate that is allocated to out-of-stream use after protection in each bioperiod."]
["100_DAY_STATS",null,"Mean, maximum, and minimum daily flows, duration of high flows, duration of low flows,and mean percent daily change for 100 days prior to the date specified on SCENARIOS"]
["QDAILY",null,"Daily streamflow"]
[]
["Output files"]
["[Station ID]_MONTH.CSV",null,"A time series of monthly flow statistics for each month in the period of analysis"]
[null,"Column 1","Minimum daily streamflow for each month in the period of analysis  [L3/T]"]
[null,"Column 2","Median daily streamflow for each month in the period of analysis  [L3/T]"]
[null,"Column 3","Mean daily streamflow for each month in the period of analysis [L3/T]"]
[null,"Column 4","Maximum daily streamflow for each month in the period of analysis [L3/T]"]
[null,"Column 5","Number of high streamflow events in the month [number of events]"]
[null,"Column 6","Duration of low streamflow during the month [days]"]
[]
["[Station ID]_FLOWDUR.CSV",null,"Streamflow equalled or exceeded for the specified fraction of time from 0.001 to 1 [L3/T]"]

{"sheet":"SETTINGS","index":2,"n_rows":5,"n_cols":4,"rows_kept":5,"cut":false,"hidden":false,"merged":[]}
["Settings: enter a value into blue cells, B2:B5","Specify option","Default"]
["Units conversion factor: use 0.02832 to convert from cubic feet per second to cubic meters per second; use 1 to keep output units the same as input units",{"$f":"1/35.31","v":2.8320589068252619E-2},{"$f":"1/35.31","v":2.8320589068252619E-2}]
["Minimum number of years in the period of analysis required for each site. Note that if the period of analysis on the settings sheet is less than the minimum number of years, statistics will not be calculated for the site.",1,10,"years"]
["Minimum number of days in each water years for that water year to be included in calculations. For example, if the user wants to include years with up to 10 missing days, then 355 would be entered in B4.",360,365,"days"]
["First month for of year for calculating low flow statistics. Annual low-flow statistics should be calculated for over 12 months beginning with a month unlikely to have low flows. Low flow statistics are commonly calculated based on  climate years starting in April (4), water years starting in October (10), or calendar years starting in January (1); values other than 10 will result in one less annual low flow statistic that the period of analysis.",1,4,"4-April, 10-October, 1-January"]

{"sheet":"SCENARIOS","index":3,"n_rows":3,"n_cols":30,"rows_kept":3,"cut":false,"hidden":false,"merged":[]}
["SCENARIO","FILE NAME FOR STREAMFLOW DATA","START YEAR","END YEAR","NWIS FILE (0-No, 1-Yes)","QMEAN COLUMN NUMBER (6-NWIS daily mean flow, 10-NWIS daily max, min, mean flow)","YEAR COLUMN NUMBER","MONTH COLUMN NUMBER","DAY COLUMN NUMBER","NUMBER OF HEADER LINES","TYPE OF THRESHOLD FOR HIGH FLOW EVENTS (1 - streamflow rate, 2 - exceedence duration expressed as fraction of time that flow is exceeded)","HIGH FLOW THRESHOLD (enter units of streamflow after any conversion or fraction of time exceeded such as 0.1)","TYPE OF THRESHOLD FOR LOW FLOW EVENTS (1 - streamflow rate, 2 - exceedence duration expressed as fraction of time that flow is exceeded)","LOW FLOW THRESHOLD (enter units of streamflow after any conversion or fraction of time exceeded such as 0.9)","ENVIRONMENTAL FLOW CALCULATIONS (0 - No, 1 - Yes; specify details on EFLOWS worksheet)","Bioperiod 1: the starting day of the year for each bioperiod that can represent months, times of the year associated with distinct life stages for biota , irrigation seasons, or other intra-annual patterns; if January, enter 1","Bioperiod 2: if February, then enter 32","Bioperiod 3: if March, then enter 60","Bioperiod 4: if April, then enter 91","Bioperiod 5: if May then enter 121","Bioperiod 6: if June, then enter 152","Bioperiod 7: if July, then enter 182","Bioperd 8: if August, then enter 213","Bioperiod 9: if September, then enter 244","Bioperiod 10: if October, then enter 274","Bioperiod 11: if November, then enter 305","Bioperiod 12: if December, then enter 335","Write daily streamflow to Daily Output worksheet? (0-No, 1-Yes)","Write monthly time series and flow duration files? (0-No, 1-Yes)","START DATE FOR 100-DAY STATISTICS (YYYY-MM-DD)"]
[null,null,null,null,"Enter 0 or 1","Enter column number","Not needed for NWIS files",null,null,null,"Enter 1 or 2",null,"Enter 1 or 2","Enter magnitude or duration","Enter 0 or 1",1,32,60,91,121,152,182,213,244,274,305,335,"Enter 0 or 1","Enter 0 or 1","Optional, enter date (YYYY-MM-DD)"]
["A","12189500.txt",1996,2000,0,6,3,4,5,0,2,0.1,2,0.9,0,null,null,null,null,null,null,null,null,null,null,null,null,1,0,"1995-10-01"]

{"sheet":"EFLOWS","index":4,"n_rows":2,"n_cols":43,"rows_kept":2,"cut":false,"hidden":false,"merged":[]}
["SCENARIO","FILE NAME FOR STREAMFLOW DATA","START YEAR","END YEAR","PRIORITY ALLOCATION BASIS:  an integer code corresponding to a streamflow statistic that provides a basis for environmental flow standard:  \n0 - no priority allocation; \n1 - daily streamflow; \n2 - mean streamflow; \n3 - streamflow exceeded for specified fraction of period of analysis; \n4 - flow exceeded for specified fraction of each bioperiod; \n5 - mean streamflow for bioperiod; \n6 -10th percentile of the annual series of 7-day minimum streamflow (estimate of 10-year, 7-day low flow or \"7Q10\"); or \n7 - fixed amount to be entered into each month.","PRIORITY ALLOCATION IN BIOPERIOD 1: Fraction of the streamflow statistic specified in previous column or fixed rate for the priority allocation for bioperiod 1","Priority allocation in bioperiod 2","Priority allocation in bioperiod 3","Priority allocation in bioperiod 4","Priority allocation in bioperiod 5","Priority allocation in bioperiod 6","Priority allocation in bioperiod 7","Priority allocation in bioperiod 8","Priority allocation in bioperiod 9","Priority allocation in bioperiod 10","Priority allocation in bioperiod 11","Priority allocation in bioperiod 12","ENVIRONMENTAL FLOW BASIS:  an integer code corresponding to a streamflow statistic that provides a basis for environmental flow standard:  \n0 - no environmental flow standard; \n1 - daily streamflow; \n2 - mean streamflow; \n3 - streamflow exceeded for specified fraction of period of analysis; \n4 - flow exceeded for specified fraction of each bioperiod;\n5 - mean streamflow for bioperiod; \n6 -10th percentile of the annual series of 7-day minimum streamflow (estimate of 10-year, 7-day low flow or \"7Q10\"); or \n7 - fixed amount to be entered into each bioperiod.","ENVIRONMENTAL FLOW STANDARD IN BIOPERIOD 1: Fraction of the streamflow statistic specified in previous column or fixed rate for the environmental flow standard for bioperiod 1","Environmental flow standard in bioperiod 2","Environmental flow standard in bioperiod 3","Environmental flow standard in bioperiod 4","Environmental flow standard in bioperiod 5","Environmental flow standard in bioperiod 6","Environmental flow standard in bioperiod 7","Environmental flow standard in bioperiod 8","Environmental flow standard in bioperiod 9","Environmental flow standard in bioperiod 10","Environmental flow standard in bioperiod 11","Environmental flow standard in bioperiod 12","ADDITIONAL ALLOCATION BASIS: an integer code corresponding to a statistic used for additional allocation above prior appropriation:  \n0 - no additional allocation; \n1 - daily streamflow; \n2 - mean streamflow; \n3 - streamflow exceeded for specified fraction of period of analysis; \n4 - flow exceeded for specified fraction of each bioperiod; \n5 - mean streamflow for bioperiod; \n6 -10th percentile of the annual series of 7-day minimum streamflow (estimate of 10-year, 7-day low flow or \"7Q10\"); or \n7 - fixed amount to be entered into each bioperiod.","ADDITIONAL ALLOCATION: Fraction of statistic used for additional out-of-stream allocation or fixed amount of out-stream allocation for each bioperiod.","Additional allocation in bioperiod 2","Additional allocation in bioperiod 3","Additional allocation in bioperiod 4","Additional allocation in bioperiod 5","Additional allocation in bioperiod 6","Additional allocation in bioperiod 7","Additional allocation in bioperiod 8","Additional allocation in bioperiod 9","Additional allocation in bioperiod 10","Additional allocation in bioperiod 11","Additional allocation in bioperiod 12"]
[{"$f":"SCENARIOS!A2","v":0},{"$f":"SCENARIOS!B2","v":0},{"$f":"SCENARIOS!C2","v":0},{"$f":"SCENARIOS!D2","v":0},"Enter 0, 1, 2, 3, 4, 5, 6, or 7","Enter fraction or fixed rate",null,null,null,null,null,null,null,null,null,null,null,"Enter 0, 1, 2, 3, 4, 5, 6, or 7","Enter fraction or fixed rate",null,null,null,null,null,null,null,null,null,null,null,"Enter 0, 1, 2, 3, 4, 5, 6, or 7","Enter fraction or fixed rate"]

{"sheet":"SUMMARY","index":5,"n_rows":3,"n_cols":39,"rows_kept":3,"cut":false,"hidden":false,"merged":[]}
["SCENARIO","Years","Mean streamflow","Q01","Q10","Q25","Q50","Q75","Q90","Q99","50th percentile of absolute value of percent daily change","Coefficient of variation of daily flows","Coefficient of variation of log-transformed daily flows","Coefficient of variation of log-transformed annual maximum flow","Median annual maximum streamflow","Qmax/Q50","Median annual number of high-flow events","Median duration of the annual longest high-flow event","Number of months with annual probability >0.5 of having a high-flow event","Mode of highest streamflow month","Median annual minimum streamflow","Qmin/Q50","Coefficient of variation of annual minimum streamflow","Median annual number of low-flow periods","Median duration of the annual longest low-flow period","Number of months with annual probability >0.5 of having a low-flow period","Mode of lowest flow month","Fraction of years with no-flow days","Mean number of no-flow days in years with no-flow days","Coefficient of variation of annual mean streamflow","Storm-flow recession coefficient (SFR)","Base-flow recession coefficient (BFR)","Maximum monthly streamflow","Minimum monthly streamflow","Maximum CV of monthly streamflow","Minimum CV of monthly streamflow","Normalized range of monthly streamflow","LOG(Q10/Q90)","Hydroperiod"]
[null,null,null,null,null,null,null,null,null,null,null,null,null,null,{"$f":"IF(COUNT(QMAX!B2:GS2)>0,MEDIAN(QMAX!B2:GS2),\"NA\")","v":"NA"},{"$f":"IF(G2>0,O2/G2,\"NA\")","v":"NA"},{"$f":"IF(COUNT(HIGH_NUM!B2:GS2)>0,MEDIAN(HIGH_NUM!$B2:$GS2),\"NA\")","v":"NA"},{"$f":"IF(COUNT(HIGH_DUR!B2:GS2)>0,MEDIAN(HIGH_DUR!$B2:$GS2),\"NA\")","v":"NA"},{"$f":"IF(COUNT(MONTH_EVENTS!O2:Z2)>0,COUNTIF(MONTH_EVENTS!O2:Z2,\">0.5\"),\"NA\")","v":"NA"},{"$f":"IF(COUNT(MONTH_MAX!B2:GS2)>1,MODE(MONTH_MAX!B2:GS2),\"NA\")","v":"NA"},{"$f":"IF(COUNT(QMIN!B2:GS2)>0,MEDIAN(QMIN!B2:GS2),\"NA\")","v":"NA"},{"$f":"IF(G2>0,U2/G2,\"NA\")","v":"NA"},{"$f":"IF(COUNT(QMIN!B2:GS2)>1,STDEV(QMIN!B2:GS2)/AVERAGE(QMIN!B2:GS2),\"NA\")","v":"NA"},{"$f":"IF(COUNT(LOW_NUM!B2:GS2)>0,MEDIAN(LOW_NUM!$B2:$GS2),\"NA\")","v":"NA"},{"$f":"IF(COUNT(LOW_DUR!B2:G2)>0,MEDIAN(LOW_DUR!$B2:$GS2),\"NA\")","v":"NA"},{"$f":"IF(COUNT(MONTH_EVENTS!A2:AZ2)>0,COUNTIF(MONTH_EVENTS!AO2:AZ2,\">0.5\"),\"NA\")","v":"NA"},{"$f":"IF(COUNT(MONTH_MIN!B2:GS2)>1,MODE(MONTH_MIN!B2:GS2),\"NA\")","v":"NA"},{"$f":"IF(COUNT(NO_FLOW_DAYS!B2:GS2)>0,COUNTIF(NO_FLOW_DAYS!B2:GS2,\">0\")/B2,\"NA\")","v":"NA"},{"$f":"IF(ISNUMBER(SUMMARY!AB2),IF(AB2>0,SUM(NO_FLOW_DAYS!B2:GS2)/COUNTIF(NO_FLOW_DAYS!B2:GS2,\">0\"),0),\"NA\")","v":"NA"},{"$f":"IF(COUNT(QMEAN!B2:GS2)>1,STDEV(QMEAN!B2:GS2)/SUMMARY!C2,\"NA\")","v":"NA"},{"$f":"IF(COUNT(SFR!B2:GS2)>0,MEDIAN(SFR!B2:GS2),\"NA\")","v":"NA"},{"$f":"IF(COUNT(BFR!B2:GS2)>0,MEDIAN(BFR!B2:GS2),\"NA\")","v":"NA"},{"$f":"IF(COUNT(MONTHQ!B2:M2)>0,MAX(MONTHQ!B2:M2),\"NA\")","v":"NA"},{"$f":"IF(COUNT(MONTHQ!B2:M2)>0,MIN(MONTHQ!B2:M2),\"NA\")","v":"NA"},{"$f":"IF(COUNT(MONTHQ!O2:Z2)>0,MAX(MONTHQ!O2:Z2),\"NA\")","v":"NA"},{"$f":"IF(COUNT(MONTHQ!O2:Z2)>0,MIN(MONTHQ!O2:Z2),\"NA\")","v":"NA"},{"$f":"IF(COUNT(VAR_MONTH!B2:GS2)>0,MEDIAN(VAR_MONTH!B2:GS2),\"NA\")","v":"NA"},{"$f":"IF(I2>0,LOG(E2/I2),\"NA\")","v":"NA"},{"$f":"IF(ISNUMBER(AB2),1-AB2*AC2/365,\"NA\")","v":"NA"}]
["12189500.txt_A",5,141.13107503374977,570.71651090342675,260.91758708581136,171.97677711696403,112.00792976493911,69.597847635230806,48.99461908807703,28.680260549419422,8.782742681047756E-2,0.83423784724335059,0.45553895135986489,0.28449935644995489,{"$f":"IF(COUNT(QMAX!B3:GS3)>0,MEDIAN(QMAX!B3:GS3),\"NA\")","v":880.77032002265651},{"$f":"IF(G3>0,O3/G3,\"NA\")","v":7.8634639696586603},{"$f":"IF(COUNT(HIGH_NUM!B3:GS3)>0,MEDIAN(HIGH_NUM!$B3:$GS3),\"NA\")","v":10},{"$f":"IF(COUNT(HIGH_DUR!B3:GS3)>0,MEDIAN(HIGH_DUR!$B3:$GS3),\"NA\")","v":11},{"$f":"IF(COUNT(MONTH_EVENTS!O3:Z3)>0,COUNTIF(MONTH_EVENTS!O3:Z3,\">0.5\"),\"NA\")","v":6},{"$f":"IF(COUNT(MONTH_MAX!B3:GS3)>1,MODE(MONTH_MAX!B3:GS3),\"NA\")","v":11},{"$f":"IF(COUNT(QMIN!B3:GS3)>0,MEDIAN(QMIN!B3:GS3),\"NA\")","v":31.435853865760407},{"$f":"IF(G3>0,U3/G3,\"NA\")","v":0.2806573957016435},{"$f":"IF(COUNT(QMIN!B3:GS3)>1,STDEV(QMIN!B3:GS3)/AVERAGE(QMIN!B3:GS3),\"NA\")","v":0.32890691930582122},{"$f":"IF(COUNT(LOW_NUM!B3:GS3)>0,MEDIAN(LOW_NUM!$B3:$GS3),\"NA\")","v":6},{"$f":"IF(COUNT(LOW_DUR!B3:G3)>0,MEDIAN(LOW_DUR!$B3:$GS3),\"NA\")","v":11},{"$f":"IF(COUNT(MONTH_EVENTS!A3:AZ3)>0,COUNTIF(MONTH_EVENTS!AO3:AZ3,\">0.5\"),\"NA\")","v":3},{"$f":"IF(COUNT(MONTH_MIN!B3:GS3)>1,MODE(MONTH_MIN!B3:GS3),\"NA\")","v":10},{"$f":"IF(COUNT(NO_FLOW_DAYS!B3:GS3)>0,COUNTIF(NO_FLOW_DAYS!B3:GS3,\">0\")/B3,\"NA\")","v":0},{"$f":"IF(ISNUMBER(SUMMARY!AB3),IF(AB3>0,SUM(NO_FLOW_DAYS!B3:GS3)/COUNTIF(NO_FLOW_DAYS!B3:GS3,\">0\"),0),\"NA\")","v":0},{"$f":"IF(COUNT(QMEAN!B3:GS3)>1,STDEV(QMEAN!B3:GS3)/SUMMARY!C3,\"NA\")","v":0.15571630637298231},{"$f":"IF(COUNT(SFR!B3:GS3)>0,MEDIAN(SFR!B3:GS3),\"NA\")","v":-0.22496373780707737},{"$f":"IF(COUNT(BFR!B3:GS3)>0,MEDIAN(BFR!B3:GS3),\"NA\")","v":-8.1608406090927996E-2},{"$f":"IF(COUNT(MONTHQ!B3:M3)>0,MAX(MONTHQ!B3:M3),\"NA\")","v":233.08222411026154},{"$f":"IF(COUNT(MONTHQ!B3:M3)>0,MIN(MONTHQ!B3:M3),\"NA\")","v":56.758614179174934},{"$f":"IF(COUNT(MONTHQ!O3:Z3)>0,MAX(MONTHQ!O3:Z3),\"NA\")","v":0.5881108561254591},{"$f":"IF(COUNT(MONTHQ!O3:Z3)>0,MIN(MONTHQ!O3:Z3),\"NA\")","v":0.23530548241463575},{"$f":"IF(COUNT(VAR_MONTH!B3:GS3)>0,MEDIAN(VAR_MONTH!B3:GS3),\"NA\")","v":1.6013302999126664},{"$f":"IF(I3>0,LOG(E3/I3),\"NA\")","v":0.72635496803393595},{"$f":"IF(ISNUMBER(AB3),1-AB3*AC3/365,\"NA\")","v":1}]

{"sheet":"YEAR","index":6,"n_rows":3,"n_cols":6,"rows_kept":3,"cut":false,"hidden":false,"merged":[]}
[]
[]
["12189500.txt_A",1996,1997,1998,1999,2000]

{"sheet":"QMAX","index":7,"n_rows":3,"n_cols":6,"rows_kept":3,"cut":false,"hidden":false,"merged":[]}
[]
[]
["12189500.txt_A",1710.5635797224581,880.77032002265651,668.36590201076183,600.39648824695553,1141.3197394505805]

{"sheet":"QMEAN","index":8,"n_rows":3,"n_cols":6,"rows_kept":3,"cut":false,"hidden":false,"merged":[]}
[]
[]
["12189500.txt_A",160.32161665683955,164.92747213525607,112.70135744850896,140.28242998413273,127.40752089610669]

{"sheet":"QMIN","index":9,"n_rows":3,"n_cols":6,"rows_kept":3,"cut":false,"hidden":false,"merged":[]}
[]
[]
["12189500.txt_A",34.834324553950722,51.543472104219767,26.224865477201924,23.449447748513169,31.435853865760407]

{"sheet":"Q50","index":10,"n_rows":3,"n_cols":6,"rows_kept":3,"cut":false,"hidden":false,"merged":[]}
[]
[]
["12189500.txt_A",124.61059190031152,131.12432738600964,93.316340979892374,110.30869442084395,108.18465024072501]

{"sheet":"Q90","index":11,"n_rows":3,"n_cols":6,"rows_kept":3,"cut":false,"hidden":false,"merged":[]}
[]
[]
["12189500.txt_A",56.471254602095712,67.261399037099963,40.073633531577457,39.507221750212402,47.068819031435844]

{"sheet":"Q10","index":12,"n_rows":3,"n_cols":6,"rows_kept":3,"cut":false,"hidden":false,"merged":[]}
[]
[]
["12189500.txt_A",299.06542056074761,311.52647975077883,194.84565278957803,273.2936845086378,238.006230529595]

{"sheet":"NO_FLOW_DAYS","index":13,"n_rows":3,"n_cols":6,"rows_kept":3,"cut":false,"hidden":false,"merged":[]}
[]
[]
["12189500.txt_A",0,0,0,0,0]

{"sheet":"HIGH_NUM","index":14,"n_rows":3,"n_cols":6,"rows_kept":3,"cut":false,"hidden":false,"merged":[]}
[]
[]
["12189500.txt_A",10,11,5,15,8]

{"sheet":"HIGH_DUR","index":15,"n_rows":3,"n_cols":6,"rows_kept":3,"cut":false,"hidden":false,"merged":[]}
[]
[]
["12189500.txt_A",12,11,7,13,8]

{"sheet":"LOW_NUM","index":16,"n_rows":3,"n_cols":6,"rows_kept":3,"cut":false,"hidden":false,"merged":[]}
[]
[]
["12189500.txt_A",7,0,5,6,7]

{"sheet":"LOW_DUR","index":17,"n_rows":3,"n_cols":6,"rows_kept":3,"cut":false,"hidden":false,"merged":[]}
[]
[]
["12189500.txt_A",11,0,53,17,8]

{"sheet":"PDC50","index":18,"n_rows":3,"n_cols":6,"rows_kept":3,"cut":false,"hidden":false,"merged":[]}
[]
[]
["12189500.txt_A",9.3213423744397089E-2,8.9041095890410926E-2,7.8341013824884856E-2,9.2814371257485026E-2,9.3549962407864035E-2]

{"sheet":"BFR","index":19,"n_rows":3,"n_cols":6,"rows_kept":3,"cut":false,"hidden":false,"merged":[]}
[]
[]
["12189500.txt_A",-8.6285266457680268E-2,-7.8651685393258494E-2,-7.5085324232081821E-2,-8.3874458874458824E-2,-8.1608406090927996E-2]

{"sheet":"SFR","index":20,"n_rows":3,"n_cols":6,"rows_kept":3,"cut":false,"hidden":false,"merged":[]}
[]
[]
["12189500.txt_A",-0.2180887388473596,-0.23123732251521303,-0.17034334637676893,-0.22496373780707737,-0.23216890156918685]

{"sheet":"CV_LOG_DAILY","index":21,"n_rows":3,"n_cols":6,"rows_kept":3,"cut":false,"hidden":false,"merged":[]}
[]
[]
["12189500.txt_A",0.4499887012098861,0.40765771493640907,0.41034080666119355,0.50850470076411258,0.44584811435549981]

{"sheet":"MONTH_MAX","index":22,"n_rows":3,"n_cols":6,"rows_kept":3,"cut":false,"hidden":false,"merged":[]}
[]
[]
["12189500.txt_A",11,3,10,12,11]

{"sheet":"MONTH_MIN","index":23,"n_rows":3,"n_cols":6,"rows_kept":3,"cut":false,"hidden":false,"merged":[]}
[]
[]
["12189500.txt_A",10,9,11,10,9]

{"sheet":"VAR_MONTH","index":24,"n_rows":3,"n_cols":6,"rows_kept":3,"cut":false,"hidden":false,"merged":[]}
[]
[]
["12189500.txt_A",2.2856562302416612,1.2294085042659229,1.3903858037084225,1.6639754332274153,1.6013302999126664]

{"sheet":"MONTHQ","index":25,"n_rows":3,"n_cols":39,"rows_kept":3,"cut":false,"hidden":false,"merged":[]}
[null,"Mean monthly streamflow",null,null,null,null,null,null,null,null,null,null,null,null,"CV annual monthly mean streamflow",null,null,null,null,null,null,null,null,null,null,null,null,"Median annual monthly mean streamflow"]
[null,"October","November","December","January","February","March","April","May","June","July","August","September",null,"October","November","December","January","February","March","April","May","June","July","August","September",null,"October","November","December","January","February","March","April","May","June","July","August","September"]
["12189500.txt_A",108.75215830295721,207.27858019446802,155.88931217511259,149.10516074218214,121.81222472875712,101.76227149395676,112.38176154064006,183.05697919807054,233.08222411026154,177.31064031938314,85.842446168041576,56.758614179174934,null,0.53088273191101099,0.5881108561254591,0.34018629766081177,0.31972597160060828,0.54012063313617475,0.45820428221719484,0.23530548241463575,0.30208300209443556,0.2760559919450114,0.35842054335944812,0.43585015753001582,0.44431747767037588,null,96.774193548387117,140.6589257056547,171.93338266597235,160.85181023378189,103.94667637658291,88.140981719516574,125.3752478051543,167.11888252436941,260.76654394411401,155.79064689706831,73.067119796091788,49.70263381478334]

{"sheet":"MONTH_EVENTS","index":26,"n_rows":3,"n_cols":52,"rows_kept":3,"cut":false,"hidden":false,"merged":[]}
[null,"MEDHIGHDUR",null,null,null,null,null,null,null,null,null,null,null,null,"FRACTION OF YEARSWITHHIGHFLOWEVENTS",null,null,null,null,null,null,null,null,null,null,null,null,"MEDLOWDUR",null,null,null,null,null,null,null,null,null,null,null,null,"FRACTION OF YEARSWITHLOWFLOWEVENTS"]
[null,"October","November","December","January","February","March","April","May","June","July","August","September",null,"October","November","December","January","February","March","April","May","June","July","August","September",null,"October","November","December","January","February","March","April","May","June","July","August","September",null,"October","November","December","January","February","March","April","May","June","July","August","September"]
["12189500.txt_A",1,4,6,2,0,0,0,3,14,0,0,0,null,0.6,1,1,0.6,0.4,0.2,0.4,0.8,0.6,0.4,0,0.2,null,9,0,0,0,0,0,0,0,0,0,3,17,null,0.6,0.2,0,0.2,0.2,0.4,0.2,0,0,0,0.6,0.8]

{"sheet":"MONTHLY_QMEAN","index":27,"n_rows":3,"n_cols":61,"rows_kept":3,"cut":false,"hidden":false,"merged":[]}
[]
[]
["12189500.txt_A",140.41530773517505,416.14273576890395,218.38828441179965,179.30587149761101,232.4534419281438,89.748860324681843,127.66921551968284,124.37306437909393,155.33843103936564,135.09834552945799,63.346762773956009,49.70263381478334,96.774193548387117,126.64023411686961,97.13048483021349,200.61026301605136,125.9254763927661,183.44433177113311,140.47012177853304,273.94231735503968,299.53743037855196,231.0411927535834,100.83956843076528,99.197583309732849,189.95806725683121,140.6589257056547,104.53951635742406,124.97601885603092,78.043451875227575,81.618110559925455,81.289530822241119,183.33470368441726,173.89785707542723,108.2394642840829,48.546971067320776,33.259699801755879,42.444340906806985,137.88445199660154,171.93338266597235,160.85181023378189,103.94667637658291,88.140981719516574,87.104691777588968,166.51592804743242,275.87085811384878,256.38355213272308,143.41180877207407,44.888133673180405,74.168882067585727,215.06655338431037,187.45489261015345,79.781840107435542,68.692077071065142,65.859073094526835,125.3752478051543,167.11888252436941,260.76654394411401,155.79064689706831,73.067119796091788,56.745020296422162]

{"sheet":"BIOPERIODS","index":28,"n_rows":3,"n_cols":28,"rows_kept":3,"cut":false,"hidden":false,"merged":[]}
[null,"Priority allocation",null,null,null,null,null,null,null,null,null,null,null,null,"Environmental flow standard",null,null,null,null,null,null,null,null,null,null,null,null,"Additional allocation allowed"]
["Bioperiod",1,2,3,4,5,6,7,8,9,10,11,12,null,1,2,3,4,5,6,7,8,9,10,11,12]
["12189500.txt_A"]

{"sheet":"100_DAY_STATS","index":29,"n_rows":3,"n_cols":7,"rows_kept":3,"cut":false,"hidden":false,"merged":[]}
["Streamflow statistics for 100 days prior to date listed on scenario sheet","Mean streamflow","Maximum streamflow","Minimum streamflow","Duration of high flows","Duration of low flows","Percent daily change"]
[]
["12189500.txt_A",257.93542905692436,1710.5635797224581,57.207589917870287,36,0,1.7195312500000001E-2]

{"sheet":"QDAILY","index":30,"n_rows":1828,"n_cols":2,"rows_kept":1828,"cut":false,"hidden":false,"merged":[]}
["DATE","12189500.txt_A"]
["1995-10-01",86.66100254885302]
["1995-10-02",64.004531294250924]
["1995-10-03",131.40753327669216]
["1995-10-04",120.07929764939111]
["1995-10-05",78.448031719059756]
["1995-10-06",62.305295950155759]
["1995-10-07",57.207589917870287]
["1995-10-08",60.606060606060602]
["1995-10-09",66.836590201076177]
["1995-10-10",320.02265647125461]
["1995-10-11",275.27612574341543]
["1995-10-12",209.85556499575191]
["1995-10-13",156.04644576607194]
["1995-10-14",133.38997451146983]
["1995-10-15",128.5754743698669]
["1995-10-16",228.2639478901161]
["1995-10-17",279.24100821297083]
["1995-10-18",275.55933163409799]
["1995-10-19",179.26932880203907]
["1995-10-20",145.56782781081847]
["1995-10-21",148.96629849900879]
["1995-10-22",132.54035683942226]
["1995-10-23",112.43273860096289]
["1995-10-24",101.6709147550269]
["1995-10-25",98.838855848201646]
["1995-10-26",176.72047578589635]
["1995-10-27",141.60294534126311]
["1995-10-28",115.83120928915321]
["1995-10-29",98.838855848201646]
["1995-10-30",87.510620220900591]
["1995-10-31",79.297649391107328]
["1995-11-01",72.500708014726712]
["1995-11-02",67.403001982441239]
["1995-11-03",63.721325403568393]
["1995-11-04",60.889266496743133]
["1995-11-05",63.438119512885869]
["1995-11-06",71.084678561314078]
["1995-11-07",186.34947606910222]
["1995-11-08",1614.2735768903992]
["1995-11-09",642.87737184933439]
["1995-11-10",325.68677428490514]
["1995-11-11",662.70178419711124]
["1995-11-12",441.80118946474084]
["1995-11-13",342.67912772585669]
["1995-11-14",453.12942509204191]
["1995-11-15",359.67148116680823]
["1995-11-16",337.01500991220615]
["1995-11-17",269.04559614839991]
["1995-11-18",382.32795242141037]
["1995-11-19",291.70206740300199]
["1995-11-20",234.49447748513168]
["1995-11-21",200.22656471254601]
["1995-11-22",198.24412347776834]
["1995-11-23",328.51883319173038]
["1995-11-24",407.81648258283769]
["1995-11-25",475.78589634664399]
["1995-11-26",337.01500991220615]
["1995-11-27",291.70206740300199]
["1995-11-28",611.7247238742566]
["1995-11-29",1710.5635797224581]
["1995-11-30",979.89238176154061]
["1995-12-01",484.28207306711977]
["1995-12-02",356.839422259983]
["1995-12-03",294.53412630982723]
["1995-12-04",262.24865477201928]
["1995-12-05",215.23647691871992]
["1995-12-06",184.36703483432456]
["1995-12-07",165.39224015859529]
["1995-12-08",144.43500424808835]
["1995-12-09",134.2395921835174]
["1995-12-10",305.8623619371283]
["1995-12-11",478.61795525346923]
["1995-12-12",376.66383460775984]
["1995-12-13",450.29736618521662]
["1995-12-14",359.67148116680823]
["1995-12-15",308.69442084395354]
["1995-12-16",248.93797790994051]
["1995-12-17",207.30671197960916]
["1995-12-18",186.91588785046727]
["1995-12-19",169.92353440951572]
["1995-12-20",152.3647691871991]
["1995-12-21",137.07165109034267]
["1995-12-22",125.17700368167658]
["1995-12-23",115.83120928915321]
["1995-12-24",108.18465024072501]
["1995-12-25",101.6709147550269]
["1995-12-26",96.290002832058903]
["1995-12-27",92.041914471821016]
["1995-12-28",88.643443783630701]
["1995-12-29",101.38770886434438]
["1995-12-30",136.2220334182951]
["1995-12-31",180.68535825545172]
["1996-01-01",141.88615123194563]
["1996-01-02",135.93882752761257]
["1996-01-03",260.26621353724158]
["1996-01-04",215.23647691871992]
["1996-01-05",164.25941659586519]
["1996-01-06",169.6403285188332]
["1996-01-07",475.78589634664399]
["1996-01-08",362.50354007363353]
["1996-01-09",260.83262531860663]
["1996-01-10",226.56471254602096]
["1996-01-11",191.16397621070519]
["1996-01-12",162.56018125177005]
["1996-01-13",147.26706315491361]
["1996-01-14",202.49221183800623]
["1996-01-15",334.18295100538091]
["1996-01-16",325.68677428490514]
["1996-01-17",231.37921268762389]
["1996-01-18",184.36703483432456]
["1996-01-19",157.46247521948456]
["1996-01-20",141.60294534126311]
["1996-01-21",132.54035683942226]
["1996-01-22",120.07929764939111]
["1996-01-23",114.13197394505805]
["1996-01-24",107.33503256867742]
["1996-01-25",99.971679410931742]
["1996-01-26",94.024355706598698]
["1996-01-27",88.643443783630701]
["1996-01-28",85.811384876805434]
["1996-01-29",79.86406117247239]
["1996-01-30",73.350325686774283]
["1996-01-31",71.651090342679126]
["1996-02-01",69.951854998583968]
["1996-02-02",67.403001982441239]
["1996-02-03",65.420560747663544]
["1996-02-04",70.235060889266492]
["1996-02-05",100.82129708297933]
["1996-02-06",260.26621353724158]
["1996-02-07",495.61030869442084]
["1996-02-08",994.05267629566697]
["1996-02-09",877.93826111583121]
["1996-02-10",376.66383460775984]
["1996-02-11",257.43415463041629]
["1996-02-12",217.21891815349758]
["1996-02-13",190.31435853865759]
["1996-02-14",179.26932880203907]
["1996-02-15",175.58765222316623]
["1996-02-16",174.73803455111866]
["1996-02-17",178.4197111299915]
["1996-02-18",305.8623619371283]
["1996-02-19",274.14330218068534]
["1996-02-20",221.46700651373547]
["1996-02-21",192.58000566411781]
["1996-02-22",169.92353440951572]
["1996-02-23",155.19682809402434]
["1996-02-24",139.62050410648541]
["1996-02-25",124.61059190031152]
["1996-02-26",113.84876805437553]
["1996-02-27",104.78617955253469]
["1996-02-28",96.290002832058903]
["1996-02-29",91.475502690455954]
["1996-03-01",87.510620220900591]
["1996-03-02",84.3953554233928]
["1996-03-03",82.979325969980167]
["1996-03-04",86.377796658170482]
["1996-03-05",82.696120079297643]
["1996-03-06",79.297649391107328]
["1996-03-07",77.881619937694708]
["1996-03-08",78.448031719059756]
["1996-03-09",100.25488530161427]
["1996-03-10",167.94109317473803]
["1996-03-11",159.16171056357973]
["1996-03-12",143.01897479467573]
["1996-03-13",122.62815066553384]
["1996-03-14",108.18465024072501]
["1996-03-15",117.24723874256584]
["1996-03-16",109.03426791277258]
["1996-03-17",98.838855848201646]
["1996-03-18",91.475502690455954]
["1996-03-19",88.077032002265639]
["1996-03-20",85.52817898612291]
["1996-03-21",79.580855281789866]
["1996-03-22",77.59841404701217]
["1996-03-23",75.049561030869441]
["1996-03-24",71.367884451996602]
["1996-03-25",66.836590201076177]
["1996-03-26",64.570943075615972]
["1996-03-27",62.305295950155759]
["1996-03-28",59.473237043330499]
["1996-03-29",59.190031152647975]
["1996-03-30",58.340413480600397]
["1996-03-31",56.924384027187763]
["1996-04-01",69.102237326536397]
["1996-04-02",92.041914471821016]
["1996-04-03",71.93429623336165]
["1996-04-04",64.570943075615972]
["1996-04-05",64.287737184933448]
["1996-04-06",76.748796374964598]
["1996-04-07",133.10676862078731]
["1996-04-08",156.89606343811951]
["1996-04-09",173.03879920702352]
["1996-04-10",162.84338714245257]
["1996-04-11",143.30218068535825]
["1996-04-12",129.42509204191447]
["1996-04-13",110.73350325686773]
["1996-04-14",97.422826394789013]
["1996-04-15",91.758708581138492]
["1996-04-16",109.31747380345512]
["1996-04-17",120.36250354007363]
["1996-04-18",109.03426791277258]
["1996-04-19",97.989238176154061]
["1996-04-20",92.041914471821016]
["1996-04-21",85.244973095440386]
["1996-04-22",82.412914188615119]
["1996-04-23",206.45709430756159]
["1996-04-24",322.85471537807985]
["1996-04-25",219.76777116964033]
["1996-04-26",204.75785896346645]
["1996-04-27",167.37468139337298]
["1996-04-28",139.33729821580289]
["1996-04-29",123.1945624468989]
["1996-04-30",112.71594449164543]
["1996-05-01",107.33503256867742]
["1996-05-02",101.10450297366185]
["1996-05-03",93.174738034551112]
["1996-05-04",86.377796658170482]
["1996-05-05",80.147267063154914]
["1996-05-06",77.032002265647122]
["1996-05-07",76.465590484282075]
["1996-05-08",75.615972812234489]
["1996-05-09",71.084678561314078]
["1996-05-10",67.686207873123763]
["1996-05-11",64.570943075615972]
["1996-05-12",65.420560747663544]
["1996-05-13",116.96403285188332]
["1996-05-14",191.73038799207023]
["1996-05-15",168.7907108467856]
["1996-05-16",157.17926932880204]
["1996-05-17",150.09912206173888]
["1996-05-18",173.88841687907109]
["1996-05-19",175.58765222316623]
["1996-05-20",152.93118096856415]
["1996-05-21",135.089209855565]
["1996-05-22",131.40753327669216]
["1996-05-23",140.18691588785046]
["1996-05-24",128.00906258850185]
["1996-05-25",139.90370999716794]
["1996-05-26",164.82582837723024]
["1996-05-27",167.09147550269046]
["1996-05-28",149.53271028037383]
["1996-05-29",161.1441517983574]
["1996-05-30",152.3647691871991]
["1996-05-31",132.82356273010478]
["1996-06-01",122.34494477485131]
["1996-06-02",139.90370999716794]
["1996-06-03",224.01585952987821]
["1996-06-04",248.65477201925799]
["1996-06-05",193.14641744548285]
["1996-06-06",191.16397621070519]
["1996-06-07",222.31662418578307]
["1996-06-08",230.2463891248938]
["1996-06-09",193.14641744548285]
["1996-06-10",163.97621070518267]
["1996-06-11",156.61285754743699]
["1996-06-12",151.5151515151515]
["1996-06-13",151.23194562446898]
["1996-06-14",156.32965165675446]
["1996-06-15",160.86094590767487]
["1996-06-16",159.16171056357973]
["1996-06-17",144.43500424808835]
["1996-06-18",131.12432738600964]
["1996-06-19",112.71594449164543]
["1996-06-20",107.0518266779949]
["1996-06-21",116.96403285188332]
["1996-06-22",128.29226847918437]
["1996-06-23",124.327386009629]
["1996-06-24",128.85868026054942]
["1996-06-25",132.82356273010478]
["1996-06-26",134.2395921835174]
["1996-06-27",138.77088643443784]
["1996-06-28",137.35485698102519]
["1996-06-29",128.85868026054942]
["1996-06-30",129.70829793259699]
["1996-07-01",141.60294534126311]
["1996-07-02",148.39988671764371]
["1996-07-03",167.09147550269046]
["1996-07-04",178.4197111299915]
["1996-07-05",150.66553384310393]
["1996-07-06",126.87623902577174]
["1996-07-07",124.89379779099404]
["1996-07-08",144.43500424808835]
["1996-07-09",169.92353440951572]
["1996-07-10",143.01897479467573]
["1996-07-11",138.77088643443784]
["1996-07-12",147.26706315491361]
["1996-07-13",164.25941659586519]
["1996-07-14",169.92353440951572]
["1996-07-15",164.25941659586519]
["1996-07-16",147.26706315491361]
["1996-07-17",143.01897479467573]
["1996-07-18",125.74341546304163]
["1996-07-19",120.07929764939111]
["1996-07-20",119.79609175870858]
["1996-07-21",96.290002832058903]
["1996-07-22",99.12206173888417]
["1996-07-23",118.38006230529595]
["1996-07-24",128.29226847918437]
["1996-07-25",127.72585669781931]
["1996-07-26",112.43273860096289]
["1996-07-27",113.84876805437553]
["1996-07-28",118.946474086661]
["1996-07-29",121.49532710280374]
["1996-07-30",114.69838572642311]
["1996-07-31",101.10450297366185]
["1996-08-01",84.112149532710276]
["1996-08-02",78.73123760974228]
["1996-08-03",83.545737751345229]
["1996-08-04",71.651090342679126]
["1996-08-05",115.54800339847068]
["1996-08-06",88.077032002265639]
["1996-08-07",73.06711979609176]
["1996-08-08",67.686207873123763]
["1996-08-09",71.084678561314078]
["1996-08-10",71.93429623336165]
["1996-08-11",77.032002265647122]
["1996-08-12",71.651090342679126]
["1996-08-13",63.721325403568393]
["1996-08-14",64.004531294250924]
["1996-08-15",66.270178419711129]
["1996-08-16",60.322854715378078]
["1996-08-17",55.508354573775136]
["1996-08-18",50.127442650807133]
["1996-08-19",46.16256018125177]
["1996-08-20",44.463324837156613]
["1996-08-21",46.16256018125177]
["1996-08-22",43.33050127442651]
["1996-08-23",42.480883602378931]
["1996-08-24",45.879354290569246]
["1996-08-25",47.861795525346928]
["1996-08-26",50.127442650807133]
["1996-08-27",53.525913338997448]
["1996-08-28",53.525913338997448]
["1996-08-29",53.809119229679979]
["1996-08-30",57.490795808552818]
["1996-08-31",64.854148966298496]
["1996-09-01",54.941942792410082]
["1996-09-02",45.029736618521667]
["1996-09-03",41.631265930331352]
["1996-09-04",40.498442367601243]
["1996-09-05",40.215236476918719]
["1996-09-06",55.79156046445766]
["1996-09-07",47.861795525346928]
["1996-09-08",59.473237043330499]
["1996-09-09",67.969413763806287]
["1996-09-10",50.693854432172188]
["1996-09-11",45.596148399886715]
["1996-09-12",45.596148399886715]
["1996-09-13",48.428207306711975]
["1996-09-14",47.012177853299349]
["1996-09-15",62.305295950155759]
["1996-09-16",75.049561030869441]
["1996-09-17",61.455678278108181]
["1996-09-18",48.99461908807703]
["1996-09-19",49.561030869442085]
["1996-09-20",52.109883885584821]
["1996-09-21",51.260266213537243]
["1996-09-22",59.756442934013023]
["1996-09-23",54.658736901727558]
["1996-09-24",47.578589634664397]
["1996-09-25",43.613707165109034]
["1996-09-26",40.781648258283774]
["1996-09-27",39.932030586236195]
["1996-09-28",38.799207023506085]
["1996-09-29",37.383177570093459]
["1996-09-30",37.099971679410928]
["1996-10-01",35.967148116680825]
["1996-10-02",35.117530444633246]
["1996-10-03",34.834324553950722]
["1996-10-04",48.428207306711975]
["1996-10-05",105.35259133389974]
["1996-10-06",59.190031152647975]
["1996-10-07",48.711413197394506]
["1996-10-08",46.16256018125177]
["1996-10-09",43.613707165109034]
["1996-10-10",43.33050127442651]
["1996-10-11",45.596148399886715]
["1996-10-12",52.393089776267345]
["1996-10-13",69.951854998583968]
["1996-10-14",117.81365052393089]
["1996-10-15",158.02888700084961]
["1996-10-16",104.78617955253469]
["1996-10-17",76.182384593599551]
["1996-10-18",116.68082696120079]
["1996-10-19",102.80373831775701]
["1996-10-20",79.580855281789866]
["1996-10-21",70.801472670631554]
["1996-10-22",219.76777116964033]
["1996-10-23",142.45256301331068]
["1996-10-24",171.90597564429339]
["1996-10-25",139.62050410648541]
["1996-10-26",107.33503256867742]
["1996-10-27",89.493061455678273]
["1996-10-28",167.65788728405551]
["1996-10-29",218.63494760691023]
["1996-10-30",138.20447465307279]
["1996-10-31",109.60067969413764]
["1996-11-01",94.024355706598698]
["1996-11-02",88.077032002265639]
["1996-11-03",87.510620220900591]
["1996-11-04",93.457943925233636]
["1996-11-05",84.961767204757862]
["1996-11-06",95.723591050693855]
["1996-11-07",94.873973378646269]
["1996-11-08",137.35485698102519]
["1996-11-09",160.57774001699235]
["1996-11-10",133.95638629283488]
["1996-11-11",130.55791560464456]
["1996-11-12",140.75332766921551]
["1996-11-13",234.77768337581421]
["1996-11-14",181.25177003681677]
["1996-11-15",143.01897479467573]
["1996-11-16",122.34494477485131]
["1996-11-17",110.45029736618521]
["1996-11-18",98.272444066836584]
["1996-11-19",91.19229679977343]
["1996-11-20",83.545737751345229]
["1996-11-21",77.315208156329646]
["1996-11-22",72.500708014726712]
["1996-11-23",67.403001982441239]
["1996-11-24",69.668649107901444]
["1996-11-25",85.52817898612291]
["1996-11-26",77.59841404701217]
["1996-11-27",172.18918153497592]
["1996-11-28",407.81648258283769]
["1996-11-29",200.50977060322853]
["1996-11-30",161.99376947040497]
["1996-12-01",209.00594732370433]
["1996-12-02",155.76323987538942]
["1996-12-03",125.17700368167658]
["1996-12-04",115.54800339847068]
["1996-12-05",128.85868026054942]
["1996-12-06",115.26479750778816]
["1996-12-07",105.63579722458226]
["1996-12-08",122.62815066553384]
["1996-12-09",113.28235627301048]
["1996-12-10",103.9365618804871]
["1996-12-11",104.78617955253469]
["1996-12-12",92.891532143868588]
["1996-12-13",87.227414330218068]
["1996-12-14",84.112149532710276]
["1996-12-15",77.59841404701217]
["1996-12-16",73.350325686774283]
["1996-12-17",67.969413763806287]
["1996-12-18",64.854148966298496]
["1996-12-19",64.004531294250924]
["1996-12-20",67.119796091758701]
["1996-12-21",65.703766638346082]
["1996-12-22",62.022090059473236]
["1996-12-23",60.039648824695554]
["1996-12-24",58.057207589917866]
["1996-12-25",56.641178136505239]
["1996-12-26",53.525913338997448]
["1996-12-27",53.525913338997448]
["1996-12-28",52.393089776267345]
["1996-12-29",55.225148683092605]
["1996-12-30",148.68309260832626]
["1996-12-31",266.21353724157461]
["1997-01-01",589.06825261965446]
["1997-01-02",489.9461908807703]
["1997-01-03",351.17530444633246]
["1997-01-04",222.31662418578307]
["1997-01-05",164.82582837723024]
["1997-01-06",142.16935712262816]
["1997-01-07",175.30444633248371]
["1997-01-08",158.02888700084961]
["1997-01-09",134.2395921835174]
["1997-01-10",120.64570943075616]
["1997-01-11",110.45029736618521]
["1997-01-12",100.5380911922968]
["1997-01-13",92.041914471821016]
["1997-01-14",85.811384876805434]
["1997-01-15",80.430472953837437]
["1997-01-16",75.615972812234489]
["1997-01-17",138.48768054375532]
["1997-01-18",207.87312376097421]
["1997-01-19",373.83177570093454]
["1997-01-20",322.85471537807985]
["1997-01-21",242.70744831492493]
["1997-01-22",191.16397621070519]
["1997-01-23",163.12659303313509]
["1997-01-24",139.90370999716794]
["1997-01-25",120.36250354007363]
["1997-01-26",106.20220900594732]
["1997-01-27",98.555649957519108]
["1997-01-28",105.35259133389974]
["1997-01-29",111.58312092891532]
["1997-01-30",472.95383743981876]
["1997-01-31",331.35089209855562]
["1997-02-01",270.17841971113]
["1997-02-02",222.59983007646559]
["1997-02-03",174.73803455111866]
["1997-02-04",147.26706315491361]
["1997-02-05",127.44265080713679]
["1997-02-06",113.565562163693]
["1997-02-07",103.65335598980458]
["1997-02-08",96.290002832058903]
["1997-02-09",90.342679127725859]
["1997-02-10",85.52817898612291]
["1997-02-11",81.846502407250071]
["1997-02-12",88.926649674313225]
["1997-02-13",86.377796658170482]
["1997-02-14",108.46785613140753]
["1997-02-15",161.42735768903992]
["1997-02-16",133.67318040215235]
["1997-02-17",154.91362220334182]
["1997-02-18",160.57774001699235]
["1997-02-19",173.88841687907109]
["1997-02-20",159.72812234494478]
["1997-02-21",130.84112149532709]
["1997-02-22",109.88388558482016]
["1997-02-23",98.272444066836584]
["1997-02-24",92.608326253186064]
["1997-02-25",90.342679127725859]
["1997-02-26",90.342679127725859]
["1997-02-27",86.377796658170482]
["1997-02-28",85.811384876805434]
["1997-03-01",89.493061455678273]
["1997-03-02",95.440385160011331]
["1997-03-03",88.360237892948177]
["1997-03-04",83.545737751345229]
["1997-03-05",78.73123760974228]
["1997-03-06",89.493061455678273]
["1997-03-07",132.54035683942226]
["1997-03-08",107.90144435004248]
["1997-03-09",115.26479750778816]
["1997-03-10",130.55791560464456]
["1997-03-11",106.76862078731237]
["1997-03-12",94.307561597281222]
["1997-03-13",85.52817898612291]
["1997-03-14",79.014443500424804]
["1997-03-15",80.430472953837437]
["1997-03-16",131.12432738600964]
["1997-03-17",121.2121212121212]
["1997-03-18",185.78306428773718]
["1997-03-19",880.77032002265651]
["1997-03-20",795.80855281789854]
["1997-03-21",396.48824695553668]
["1997-03-22",259.69980175587654]
["1997-03-23",204.19144718210137]
["1997-03-24",170.48994619088077]
["1997-03-25",146.98385726423109]
["1997-03-26",182.38459359954686]
["1997-03-27",176.72047578589635]
["1997-03-28",163.97621070518267]
["1997-03-29",146.13423959218352]
["1997-03-30",134.80600396488248]
["1997-03-31",132.82356273010478]
["1997-04-01",119.79609175870858]
["1997-04-02",109.60067969413764]
["1997-04-03",104.21976777116964]
["1997-04-04",97.989238176154061]
["1997-04-05",92.891532143868588]
["1997-04-06",89.209855564995749]
["1997-04-07",86.944208439535544]
["1997-04-08",85.52817898612291]
["1997-04-09",84.112149532710276]
["1997-04-10",82.412914188615119]
["1997-04-11",81.280090625885023]
["1997-04-12",80.713678844519961]
["1997-04-13",88.643443783630701]
["1997-04-14",93.174738034551112]
["1997-04-15",95.440385160011331]
["1997-04-16",124.327386009629]
["1997-04-17",150.38232795242141]
["1997-04-18",128.00906258850185]
["1997-04-19",131.12432738600964]
["1997-04-20",311.52647975077883]
["1997-04-21",250.63721325403569]
["1997-04-22",187.48229963183235]
["1997-04-23",171.62276975361087]
["1997-04-24",165.95865193996033]
["1997-04-25",156.89606343811951]
["1997-04-26",173.32200509770604]
["1997-04-27",259.98300764655903]
["1997-04-28",225.99830076465591]
["1997-04-29",199.37694704049844]
["1997-04-30",185.49985839705465]
["1997-05-01",192.58000566411781]
["1997-05-02",160.86094590767487]
["1997-05-03",153.21438685924667]
["1997-05-04",149.81591617105636]
["1997-05-05",145.00141602945342]
["1997-05-06",196.26168224299064]
["1997-05-07",201.64259416595866]
["1997-05-08",185.78306428773718]
["1997-05-09",198.24412347776834]
["1997-05-10",239.30897762673462]
["1997-05-11",274.99291985273294]
["1997-05-12",348.34324553950722]
["1997-05-13",413.48060039648823]
["1997-05-14",450.29736618521662]
["1997-05-15",470.12177853299346]
["1997-05-16",458.79354290569245]
["1997-05-17",427.64089493061454]
["1997-05-18",351.17530444633246]
["1997-05-19",305.8623619371283]
["1997-05-20",288.87000849617669]
["1997-05-21",240.72500708014726]
["1997-05-22",208.72274143302181]
["1997-05-23",204.47465307278392]
["1997-05-24",196.54488813367317]
["1997-05-25",193.99603511753045]
["1997-05-26",198.24412347776834]
["1997-05-27",210.988388558482]
["1997-05-28",239.59218351741717]
["1997-05-29",311.52647975077883]
["1997-05-30",354.00736335315776]
["1997-05-31",521.09883885584816]
["1997-06-01",489.9461908807703]
["1997-06-02",348.34324553950722]
["1997-06-03",334.18295100538091]
["1997-06-04",370.9997167941093]
["1997-06-05",317.19059756442931]
["1997-06-06",280.94024355706597]
["1997-06-07",267.62956669498726]
["1997-06-08",254.31888983290852]
["1997-06-09",250.63721325403569]
["1997-06-10",273.2936845086378]
["1997-06-11",325.68677428490514]
["1997-06-12",322.85471537807985]
["1997-06-13",279.24100821297083]
["1997-06-14",261.11583120928913]
["1997-06-15",311.52647975077883]
["1997-06-16",345.51118663268193]
["1997-06-17",424.8088360237893]
["1997-06-18",506.93854432172191]
["1997-06-19",370.9997167941093]
["1997-06-20",282.07306711979606]
["1997-06-21",245.82271311243272]
["1997-06-22",240.15859529878222]
["1997-06-23",250.07080147267064]
["1997-06-24",252.90286037949588]
["1997-06-25",234.21127159444916]
["1997-06-26",246.3891248937978]
["1997-06-27",221.46700651373547]
["1997-06-28",203.05862361937128]
["1997-06-29",244.97309544038515]
["1997-06-30",228.83035967148115]
["1997-07-01",209.00594732370433]
["1997-07-02",196.82809402435569]
["1997-07-03",204.47465307278392]
["1997-07-04",243.84027187765506]
["1997-07-05",300.19824412347776]
["1997-07-06",297.36618521665253]
["1997-07-07",263.94789011611442]
["1997-07-08",314.35853865760407]
["1997-07-09",600.39648824695553]
["1997-07-10",362.50354007363353]
["1997-07-11",280.65703766638347]
["1997-07-12",234.77768337581421]
["1997-07-13",212.40441801189465]
["1997-07-14",226.84791843670348]
["1997-07-15",237.04333050127443]
["1997-07-16",223.73265363919569]
["1997-07-17",218.35174171622768]
["1997-07-18",205.89068252619654]
["1997-07-19",210.13877088643443]
["1997-07-20",232.79524214103654]
["1997-07-21",244.12347776833758]
["1997-07-22",216.65250637213254]
["1997-07-23",184.08382894364203]
["1997-07-24",166.52506372132541]
["1997-07-25",154.91362220334182]
["1997-07-26",148.11668082696119]
["1997-07-27",144.71821013877087]
["1997-07-28",156.89606343811951]
["1997-07-29",169.07391673746812]
["1997-07-30",156.89606343811951]
["1997-07-31",144.71821013877087]
["1997-08-01",131.40753327669216]
["1997-08-02",130.27470971396204]
["1997-08-03",129.99150382327952]
["1997-08-04",140.18691588785046]
["1997-08-05",143.30218068535825]
["1997-08-06",153.4975927499292]
["1997-08-07",161.99376947040497]
["1997-08-08",129.70829793259699]
["1997-08-09",109.88388558482016]
["1997-08-10",101.6709147550269]
["1997-08-11",100.5380911922968]
["1997-08-12",103.37015009912206]
["1997-08-13",108.18465024072501]
["1997-08-14",106.76862078731237]
["1997-08-15",112.14953271028037]
["1997-08-16",97.706032285471537]
["1997-08-17",88.077032002265639]
["1997-08-18",84.3953554233928]
["1997-08-19",82.129708297932595]
["1997-08-20",80.713678844519961]
["1997-08-21",82.696120079297643]
["1997-08-22",79.86406117247239]
["1997-08-23",76.182384593599551]
["1997-08-24",72.783913905409236]
["1997-08-25",70.518266779949016]
["1997-08-26",75.049561030869441]
["1997-08-27",95.157179269328793]
["1997-08-28",73.633531577456807]
["1997-08-29",70.235060889266492]
["1997-08-30",68.535825545171335]
["1997-08-31",65.420560747663544]
["1997-09-01",69.668649107901444]
["1997-09-02",73.350325686774283]
["1997-09-03",69.102237326536397]
["1997-09-04",66.836590201076177]
["1997-09-05",60.322854715378078]
["1997-09-06",57.207589917870287]
["1997-09-07",53.809119229679979]
["1997-09-08",51.543472104219767]
["1997-09-09",51.82667799490229]
["1997-09-10",52.676295666949869]
["1997-09-11",55.508354573775136]
["1997-09-12",59.473237043330499]
["1997-09-13",58.623619371282921]
["1997-09-14",62.871707731520814]
["1997-09-15",83.545737751345229]
["1997-09-16",101.10450297366185]
["1997-09-17",280.09062588501843]
["1997-09-18",356.839422259983]
["1997-09-19",164.82582837723024]
["1997-09-20",109.31747380345512]
["1997-09-21",87.793826111583115]
["1997-09-22",77.032002265647122]
["1997-09-23",69.951854998583968]
["1997-09-24",65.420560747663544]
["1997-09-25",64.854148966298496]
["1997-09-26",95.157179269328793]
["1997-09-27",225.14868309260831]
["1997-09-28",146.41744548286604]
["1997-09-29",111.01670914755027]
["1997-09-30",94.590767487963745]
["1997-10-01",123.1945624468989]
["1997-10-02",179.26932880203907]
["1997-10-03",256.30133106768619]
["1997-10-04",625.88501840838285]
["1997-10-05",625.88501840838285]
["1997-10-06",308.69442084395354]
["1997-10-07",214.10365335598979]
["1997-10-08",168.50750495610308]
["1997-10-09",142.16935712262816]
["1997-10-10",141.88615123194563]
["1997-10-11",139.05409232512037]
["1997-10-12",127.72585669781931]
["1997-10-13",122.91135655621636]
["1997-10-14",120.64570943075616]
["1997-10-15",113.84876805437553]
["1997-10-16",123.1945624468989]
["1997-10-17",117.53044463324836]
["1997-10-18",110.73350325686773]
["1997-10-19",96.856414613423951]
["1997-10-20",88.643443783630701]
["1997-10-21",82.696120079297643]
["1997-10-22",77.881619937694708]
["1997-10-23",75.615972812234489]
["1997-10-24",72.783913905409236]
["1997-10-25",69.102237326536397]
["1997-10-26",68.535825545171335]
["1997-10-27",90.909090909090907]
["1997-10-28",78.164825828377232]
["1997-10-29",210.13877088643443]
["1997-10-30",668.36590201076183]
["1997-10-31",447.46530727839138]
["1997-11-01",342.67912772585669]
["1997-11-02",234.77768337581421]
["1997-11-03",217.21891815349758]
["1997-11-04",286.03794958935146]
["1997-11-05",194.27924100821298]
["1997-11-06",176.4372698952138]
["1997-11-07",161.99376947040497]
["1997-11-08",140.75332766921551]
["1997-11-09",124.327386009629]
["1997-11-10",111.58312092891532]
["1997-11-11",100.82129708297933]
["1997-11-12",91.758708581138492]
["1997-11-13",84.3953554233928]
["1997-11-14",78.164825828377232]
["1997-11-15",72.500708014726712]
["1997-11-16",68.819031435853859]
["1997-11-17",71.93429623336165]
["1997-11-18",86.944208439535544]
["1997-11-19",74.483149249504393]
["1997-11-20",132.82356273010478]
["1997-11-21",148.96629849900879]
["1997-11-22",104.78617955253469]
["1997-11-23",117.81365052393089]
["1997-11-24",193.7128292268479]
["1997-11-25",144.15179835740582]
["1997-11-26",115.54800339847068]
["1997-11-27",99.405267629566694]
["1997-11-28",154.06400453129424]
["1997-11-29",151.23194562446898]
["1997-11-30",137.35485698102519]
["1997-12-01",117.24723874256584]
["1997-12-02",100.5380911922968]
["1997-12-03",89.209855564995749]
["1997-12-04",80.996884735202485]
["1997-12-05",74.766355140186917]
["1997-12-06",69.668649107901444]
["1997-12-07",65.703766638346082]
["1997-12-08",65.13735485698102]
["1997-12-09",62.305295950155759]
["1997-12-10",59.190031152647975]
["1997-12-11",57.490795808552818]
["1997-12-12",54.658736901727558]
["1997-12-13",52.676295666949869]
["1997-12-14",51.82667799490229]
["1997-12-15",56.924384027187763]
["1997-12-16",248.65477201925799]
["1997-12-17",314.35853865760407]
["1997-12-18",185.78306428773718]
["1997-12-19",135.37241574624753]
["1997-12-20",117.53044463324836]
["1997-12-21",110.73350325686773]
["1997-12-22",93.741149815916174]
["1997-12-23",85.52817898612291]
["1997-12-24",78.448031719059756]
["1997-12-25",72.217502124044174]
["1997-12-26",68.252619654488811]
["1997-12-27",72.500708014726712]
["1997-12-28",100.25488530161427]
["1997-12-29",208.72274143302181]
["1997-12-30",160.57774001699235]
["1997-12-31",129.70829793259699]
["1998-01-01",168.7907108467856]
["1998-01-02",188.89832908524497]
["1998-01-03",137.35485698102519]
["1998-01-04",116.68082696120079]
["1998-01-05",109.03426791277258]
["1998-01-06",118.66326819597847]
["1998-01-07",122.34494477485131]
["1998-01-08",101.10450297366185]
["1998-01-09",86.377796658170482]
["1998-01-10",78.448031719059756]
["1998-01-11",69.102237326536397]
["1998-01-12",65.986972529028606]
["1998-01-13",68.535825545171335]
["1998-01-14",113.565562163693]
["1998-01-15",152.64797507788163]
["1998-01-16",119.22967997734352]
["1998-01-17",152.64797507788163]
["1998-01-18",161.1441517983574]
["1998-01-19",143.8685924667233]
["1998-01-20",124.61059190031152]
["1998-01-21",105.35259133389974]
["1998-01-22",95.440385160011331]
["1998-01-23",119.79609175870858]
["1998-01-24",209.57235910506938]
["1998-01-25",182.95100538091191]
["1998-01-26",162.56018125177005]
["1998-01-27",140.75332766921551]
["1998-01-28",118.09685641461343]
["1998-01-29",109.60067969413764]
["1998-01-30",122.62815066553384]
["1998-01-31",108.46785613140753]
["1998-02-01",95.440385160011331]
["1998-02-02",87.510620220900591]
["1998-02-03",80.713678844519961]
["1998-02-04",78.73123760974228]
["1998-02-05",82.696120079297643]
["1998-02-06",79.297649391107328]
["1998-02-07",78.73123760974228]
["1998-02-08",79.014443500424804]
["1998-02-09",95.723591050693855]
["1998-02-10",82.979325969980167]
["1998-02-11",76.748796374964598]
["1998-02-12",86.377796658170482]
["1998-02-13",120.07929764939111]
["1998-02-14",98.555649957519108]
["1998-02-15",84.961767204757862]
["1998-02-16",76.748796374964598]
["1998-02-17",69.668649107901444]
["1998-02-18",65.13735485698102]
["1998-02-19",70.518266779949016]
["1998-02-20",68.535825545171335]
["1998-02-21",78.73123760974228]
["1998-02-22",83.262531860662705]
["1998-02-23",71.651090342679126]
["1998-02-24",64.570943075615972]
["1998-02-25",60.889266496743133]
["1998-02-26",59.473237043330499]
["1998-02-27",55.508354573775136]
["1998-02-28",52.9595015576324]
["1998-03-01",61.455678278108181]
["1998-03-02",75.332766921551965]
["1998-03-03",69.385443217218921]
["1998-03-04",61.172472387425657]
["1998-03-05",56.074766355140184]
["1998-03-06",52.676295666949869]
["1998-03-07",50.127442650807133]
["1998-03-08",48.428207306711975]
["1998-03-09",53.809119229679979]
["1998-03-10",59.756442934013023]
["1998-03-11",56.357972245822715]
["1998-03-12",60.889266496743133]
["1998-03-13",70.801472670631554]
["1998-03-14",82.979325969980167]
["1998-03-15",83.262531860662705]
["1998-03-16",84.961767204757862]
["1998-03-17",75.899178702917013]
["1998-03-18",67.969413763806287]
["1998-03-19",63.438119512885869]
["1998-03-20",61.455678278108181]
["1998-03-21",66.270178419711129]
["1998-03-22",95.723591050693855]
["1998-03-23",147.83347493627866]
["1998-03-24",157.46247521948456]
["1998-03-25",142.45256301331068]
["1998-03-26",139.90370999716794]
["1998-03-27",125.4602095723591]
["1998-03-28",105.63579722458226]
["1998-03-29",92.32512036250354]
["1998-03-30",83.262531860662705]
["1998-03-31",77.59841404701217]
["1998-04-01",72.500708014726712]
["1998-04-02",68.535825545171335]
["1998-04-03",65.703766638346082]
["1998-04-04",65.986972529028606]
["1998-04-05",65.703766638346082]
["1998-04-06",64.854148966298496]
["1998-04-07",62.58850184083829]
["1998-04-08",60.606060606060602]
["1998-04-09",58.623619371282921]
["1998-04-10",56.924384027187763]
["1998-04-11",59.473237043330499]
["1998-04-12",59.190031152647975]
["1998-04-13",55.79156046445766]
["1998-04-14",52.9595015576324]
["1998-04-15",51.82667799490229]
["1998-04-16",50.693854432172188]
["1998-04-17",49.844236760124609]
["1998-04-18",49.561030869442085]
["1998-04-19",57.207589917870287]
["1998-04-20",57.490795808552818]
["1998-04-21",62.022090059473236]
["1998-04-22",81.846502407250071]
["1998-04-23",143.8685924667233]
["1998-04-24",175.58765222316623]
["1998-04-25",128.85868026054942]
["1998-04-26",103.37015009912206]
["1998-04-27",95.440385160011331]
["1998-04-28",111.58312092891532]
["1998-04-29",151.23194562446898]
["1998-04-30",198.81053525913339]
["1998-05-01",288.87000849617669]
["1998-05-02",308.69442084395354]
["1998-05-03",291.70206740300199]
["1998-05-04",273.86009629000284]
["1998-05-05",286.03794958935146]
["1998-05-06",283.20589068252622]
["1998-05-07",267.34636080430471]
["1998-05-08",234.77768337581421]
["1998-05-09",194.84565278957803]
["1998-05-10",169.07391673746812]
["1998-05-11",174.73803455111866]
["1998-05-12",178.98612291135655]
["1998-05-13",209.85556499575191]
["1998-05-14",191.73038799207023]
["1998-05-15",162.56018125177005]
["1998-05-16",134.80600396488248]
["1998-05-17",123.47776833758142]
["1998-05-18",129.42509204191447]
["1998-05-19",116.39762107051827]
["1998-05-20",116.68082696120079]
["1998-05-21",135.93882752761257]
["1998-05-22",138.20447465307279]
["1998-05-23",129.14188615123194]
["1998-05-24",125.4602095723591]
["1998-05-25",176.15406400453128]
["1998-05-26",155.76323987538942]
["1998-05-27",156.61285754743699]
["1998-05-28",137.35485698102519]
["1998-05-29",127.72585669781931]
["1998-05-30",127.15944491645426]
["1998-05-31",136.78844519966015]
["1998-06-01",180.11894647408667]
["1998-06-02",197.96091758708582]
["1998-06-03",210.988388558482]
["1998-06-04",218.06853582554515]
["1998-06-05",199.66015293118096]
["1998-06-06",195.41206457094307]
["1998-06-07",211.55480033984708]
["1998-06-08",216.08609459076749]
["1998-06-09",222.03341829510055]
["1998-06-10",218.91815349759275]
["1998-06-11",193.99603511753045]
["1998-06-12",183.23421127159443]
["1998-06-13",194.84565278957803]
["1998-06-14",161.42735768903992]
["1998-06-15",183.51741716227698]
["1998-06-16",174.17162276975361]
["1998-06-17",146.98385726423109]
["1998-06-18",137.92126876239024]
["1998-06-19",130.27470971396204]
["1998-06-20",125.17700368167658]
["1998-06-21",148.68309260832626]
["1998-06-22",163.40979892381762]
["1998-06-23",173.60521098838856]
["1998-06-24",160.29453412630983]
["1998-06-25",167.37468139337298]
["1998-06-26",148.68309260832626]
["1998-06-27",130.27470971396204]
["1998-06-28",126.02662135372415]
["1998-06-29",141.03653355989803]
["1998-06-30",155.19682809402434]
["1998-07-01",171.90597564429339]
["1998-07-02",171.05635797224582]
["1998-07-03",184.36703483432456]
["1998-07-04",161.1441517983574]
["1998-07-05",135.089209855565]
["1998-07-06",122.91135655621636]
["1998-07-07",130.27470971396204]
["1998-07-08",131.69073916737469]
["1998-07-09",125.4602095723591]
["1998-07-10",125.4602095723591]
["1998-07-11",113.28235627301048]
["1998-07-12",105.06938544321721]
["1998-07-13",103.08694420843953]
["1998-07-14",94.024355706598698]
["1998-07-15",90.625885018408383]
["1998-07-16",93.457943925233636]
["1998-07-17",98.555649957519108]
["1998-07-18",94.873973378646269]
["1998-07-19",94.590767487963745]
["1998-07-20",82.412914188615119]
["1998-07-21",77.59841404701217]
["1998-07-22",84.961767204757862]
["1998-07-23",90.342679127725859]
["1998-07-24",86.66100254885302]
["1998-07-25",79.86406117247239]
["1998-07-26",87.510620220900591]
["1998-07-27",93.174738034551112]
["1998-07-28",93.457943925233636]
["1998-07-29",84.961767204757862]
["1998-07-30",76.748796374964598]
["1998-07-31",70.801472670631554]
["1998-08-01",66.836590201076177]
["1998-08-02",65.420560747663544]
["1998-08-03",70.235060889266492]
["1998-08-04",72.500708014726712]
["1998-08-05",74.483149249504393]
["1998-08-06",68.252619654488811]
["1998-08-07",56.924384027187763]
["1998-08-08",50.693854432172188]
["1998-08-09",49.277824978759554]
["1998-08-10",49.277824978759554]
["1998-08-11",48.99461908807703]
["1998-08-12",49.561030869442085]
["1998-08-13",51.543472104219767]
["1998-08-14",55.225148683092605]
["1998-08-15",54.941942792410082]
["1998-08-16",49.277824978759554]
["1998-08-17",44.180118946474089]
["1998-08-18",37.666383460775982]
["1998-08-19",34.551118663268198]
["1998-08-20",35.967148116680825]
["1998-08-21",40.498442367601243]
["1998-08-22",42.1976777116964]
["1998-08-23",39.648824695553664]
["1998-08-24",35.683942225998301]
["1998-08-25",35.967148116680825]
["1998-08-26",36.250354007363356]
["1998-08-27",35.683942225998301]
["1998-08-28",35.967148116680825]
["1998-08-29",38.799207023506085]
["1998-08-30",39.932030586236195]
["1998-08-31",38.516001132823561]
["1998-09-01",41.064854148966297]
["1998-09-02",41.914471821013876]
["1998-09-03",41.348060039648821]
["1998-09-04",40.215236476918719]
["1998-09-05",37.949589351458506]
["1998-09-06",34.834324553950722]
["1998-09-07",34.834324553950722]
["1998-09-08",35.967148116680825]
["1998-09-09",33.418295100538089]
["1998-09-10",31.15264797507788]
["1998-09-11",30.303030303030301]
["1998-09-12",31.15264797507788]
["1998-09-13",31.719059756442935]
["1998-09-14",31.15264797507788]
["1998-09-15",30.869442084395356]
["1998-09-16",31.719059756442935]
["1998-09-17",32.002265647125462]
["1998-09-18",31.719059756442935]
["1998-09-19",34.267912772585667]
["1998-09-20",32.56867742849051]
["1998-09-21",28.887000849617671]
["1998-09-22",27.839139054092325]
["1998-09-23",27.499291985273292]
["1998-09-24",28.122344944774852]
["1998-09-25",38.799207023506085]
["1998-09-26",41.064854148966297]
["1998-09-27",31.15264797507788]
["1998-09-28",29.73661852166525]
["1998-09-29",27.81081846502407]
["1998-09-30",26.706315491362218]
["1998-10-01",27.187765505522513]
["1998-10-02",31.15264797507788]
["1998-10-03",47.578589634664397]
["1998-10-04",43.613707165109034]
["1998-10-05",33.984706881903143]
["1998-10-06",33.135089209855565]
["1998-10-07",31.15264797507788]
["1998-10-08",29.73661852166525]
["1998-10-09",49.844236760124609]
["1998-10-10",47.578589634664397]
["1998-10-11",38.232795242141037]
["1998-10-12",32.002265647125462]
["1998-10-13",39.36561880487114]
["1998-10-14",116.11441517983573]
["1998-10-15",84.112149532710276]
["1998-10-16",56.924384027187763]
["1998-10-17",55.225148683092605]
["1998-10-18",79.297649391107328]
["1998-10-19",50.410648541489664]
["1998-10-20",41.914471821013876]
["1998-10-21",38.516001132823561]
["1998-10-22",35.117530444633246]
["1998-10-23",32.285471537807986]
["1998-10-24",30.586236193712828]
["1998-10-25",29.170206740300198]
["1998-10-26",28.207306711979609]
["1998-10-27",28.887000849617671]
["1998-10-28",34.551118663268198]
["1998-10-29",32.285471537807986]
["1998-10-30",29.453412630982722]
["1998-10-31",28.150665533843103]
["1998-11-01",32.002265647125462]
["1998-11-02",30.586236193712828]
["1998-11-03",28.887000849617671]
["1998-11-04",28.603794958935143]
["1998-11-05",32.002265647125462]
["1998-11-06",33.135089209855565]
["1998-11-07",29.73661852166525]
["1998-11-08",27.867459643160576]
["1998-11-09",27.244406683659019]
["1998-11-10",27.442650807136786]
["1998-11-11",26.224865477201924]
["1998-11-12",34.551118663268198]
["1998-11-13",219.76777116964033]
["1998-11-14",291.70206740300199]
["1998-11-15",385.16001132823561]
["1998-11-16",320.02265647125461]
["1998-11-17",161.1441517983574]
["1998-11-18",111.01670914755027]
["1998-11-19",88.360237892948177]
["1998-11-20",204.19144718210137]
["1998-11-21",348.34324553950722]
["1998-11-22",221.75021240441799]
["1998-11-23",160.29453412630983]
["1998-11-24",150.66553384310393]
["1998-11-25",241.85783064287736]
["1998-11-26",325.68677428490514]
["1998-11-27",195.41206457094307]
["1998-11-28",142.16935712262816]
["1998-11-29",112.71594449164543]
["1998-11-30",97.989238176154061]
["1998-12-01",92.041914471821016]
["1998-12-02",161.1441517983574]
["1998-12-03",124.04418011894647]
["1998-12-04",94.873973378646269]
["1998-12-05",80.147267063154914]
["1998-12-06",71.084678561314078]
["1998-12-07",72.500708014726712]
["1998-12-08",77.315208156329646]
["1998-12-09",65.13735485698102]
["1998-12-10",75.899178702917013]
["1998-12-11",104.50297366185217]
["1998-12-12",229.39677145284622]
["1998-12-13",600.39648824695553]
["1998-12-14",345.51118663268193]
["1998-12-15",211.55480033984708]
["1998-12-16",169.92353440951572]
["1998-12-17",160.86094590767487]
["1998-12-18",139.62050410648541]
["1998-12-19",115.26479750778816]
["1998-12-20",94.590767487963745]
["1998-12-21",85.811384876805434]
["1998-12-22",79.014443500424804]
["1998-12-23",73.350325686774283]
["1998-12-24",71.084678561314078]
["1998-12-25",73.916737468139331]
["1998-12-26",134.52279807419995]
["1998-12-27",140.47012177853298]
["1998-12-28",320.02265647125461]
["1998-12-29",489.9461908807703]
["1998-12-30",489.9461908807703]
["1998-12-31",286.03794958935146]
["1999-01-01",219.76777116964033]
["1999-01-02",166.24185783064289]
["1999-01-03",138.77088643443784]
["1999-01-04",120.36250354007363]
["1999-01-05",109.03426791277258]
["1999-01-06",99.971679410931742]
["1999-01-07",95.157179269328793]
["1999-01-08",90.909090909090907]
["1999-01-09",88.926649674313225]
["1999-01-10",133.10676862078731]
["1999-01-11",190.88077032002266]
["1999-01-12",146.41744548286604]
["1999-01-13",126.30982724440668]
["1999-01-14",424.8088360237893]
["1999-01-15",416.31265930331352]
["1999-01-16",252.61965448881335]
["1999-01-17",197.96091758708582]
["1999-01-18",221.18380062305295]
["1999-01-19",225.99830076465591]
["1999-01-20",178.70291702067402]
["1999-01-21",150.09912206173888]
["1999-01-22",143.01897479467573]
["1999-01-23",123.76097422826395]
["1999-01-24",107.0518266779949]
["1999-01-25",96.573208722741427]
["1999-01-26",88.643443783630701]
["1999-01-27",82.979325969980167]
["1999-01-28",91.475502690455954]
["1999-01-29",160.29453412630983]
["1999-01-30",171.33956386292834]
["1999-01-31",127.72585669781931]
["1999-02-01",110.16709147550269]
["1999-02-02",150.38232795242141]
["1999-02-03",148.39988671764371]
["1999-02-04",126.30982724440668]
["1999-02-05",112.71594449164543]
["1999-02-06",116.68082696120079]
["1999-02-07",139.33729821580289]
["1999-02-08",116.39762107051827]
["1999-02-09",96.573208722741427]
["1999-02-10",84.112149532710276]
["1999-02-11",75.049561030869441]
["1999-02-12",69.385443217218921]
["1999-02-13",65.986972529028606]
["1999-02-14",62.871707731520814]
["1999-02-15",58.906825261965444]
["1999-02-16",59.473237043330499]
["1999-02-17",66.553384310393653]
["1999-02-18",65.420560747663544]
["1999-02-19",63.438119512885869]
["1999-02-20",59.473237043330499]
["1999-02-21",56.924384027187763]
["1999-02-22",68.819031435853859]
["1999-02-23",89.493061455678273]
["1999-02-24",174.45482866043614]
["1999-02-25",209.57235910506938]
["1999-02-26",144.43500424808835]
["1999-02-27",132.54035683942226]
["1999-02-28",186.63268195978475]
["1999-03-01",161.71056357972245]
["1999-03-02",133.95638629283488]
["1999-03-03",120.07929764939111]
["1999-03-04",105.9190031152648]
["1999-03-05",92.608326253186064]
["1999-03-06",82.129708297932595]
["1999-03-07",74.766355140186917]
["1999-03-08",68.819031435853859]
["1999-03-09",65.703766638346082]
["1999-03-10",60.889266496743133]
["1999-03-11",57.490795808552818]
["1999-03-12",55.79156046445766]
["1999-03-13",63.438119512885869]
["1999-03-14",86.66100254885302]
["1999-03-15",81.280090625885023]
["1999-03-16",72.500708014726712]
["1999-03-17",65.13735485698102]
["1999-03-18",60.889266496743133]
["1999-03-19",59.190031152647975]
["1999-03-20",70.235060889266492]
["1999-03-21",108.18465024072501]
["1999-03-22",109.31747380345512]
["1999-03-23",108.75106202209005]
["1999-03-24",109.03426791277258]
["1999-03-25",111.86632681959784]
["1999-03-26",110.16709147550269]
["1999-03-27",101.38770886434438]
["1999-03-28",89.493061455678273]
["1999-03-29",86.944208439535544]
["1999-03-30",83.262531860662705]
["1999-03-31",74.766355140186917]
["1999-04-01",69.385443217218921]
["1999-04-02",66.270178419711129]
["1999-04-03",64.004531294250924]
["1999-04-04",60.322854715378078]
["1999-04-05",57.490795808552818]
["1999-04-06",54.658736901727558]
["1999-04-07",53.525913338997448]
["1999-04-08",55.79156046445766]
["1999-04-09",54.375531011045027]
["1999-04-10",51.260266213537243]
["1999-04-11",48.99461908807703]
["1999-04-12",51.82667799490229]
["1999-04-13",55.508354573775136]
["1999-04-14",52.9595015576324]
["1999-04-15",52.9595015576324]
["1999-04-16",60.889266496743133]
["1999-04-17",85.244973095440386]
["1999-04-18",120.07929764939111]
["1999-04-19",126.5930331350892]
["1999-04-20",129.42509204191447]
["1999-04-21",113.565562163693]
["1999-04-22",97.706032285471537]
["1999-04-23",97.139620504106489]
["1999-04-24",118.38006230529595]
["1999-04-25",170.48994619088077]
["1999-04-26",166.52506372132541]
["1999-04-27",139.90370999716794]
["1999-04-28",118.946474086661]
["1999-04-29",108.46785613140753]
["1999-04-30",110.45029736618521]
["1999-05-01",132.25715094873973]
["1999-05-02",136.50523930897762]
["1999-05-03",124.89379779099404]
["1999-05-04",119.79609175870858]
["1999-05-05",106.76862078731237]
["1999-05-06",104.21976777116964]
["1999-05-07",134.80600396488248]
["1999-05-08",123.1945624468989]
["1999-05-09",109.60067969413764]
["1999-05-10",98.838855848201646]
["1999-05-11",94.307561597281222]
["1999-05-12",111.86632681959784]
["1999-05-13",109.88388558482016]
["1999-05-14",100.25488530161427]
["1999-05-15",93.741149815916174]
["1999-05-16",90.625885018408383]
["1999-05-17",96.290002832058903]
["1999-05-18",174.73803455111866]
["1999-05-19",182.95100538091191]
["1999-05-20",158.59529878221466]
["1999-05-21",148.11668082696119]
["1999-05-22",148.68309260832626]
["1999-05-23",192.01359388275276]
["1999-05-24",337.01500991220615]
["1999-05-25",419.14471821013876]
["1999-05-26",311.52647975077883]
["1999-05-27",255.45171339563862]
["1999-05-28",258.85018408382894]
["1999-05-29",234.77768337581421]
["1999-05-30",222.88303596714812]
["1999-05-31",229.39677145284622]
["1999-06-01",272.72727272727275]
["1999-06-02",225.43188898329086]
["1999-06-03",189.46474086661001]
["1999-06-04",204.47465307278392]
["1999-06-05",257.43415463041629]
["1999-06-06",286.03794958935146]
["1999-06-07",216.08609459076749]
["1999-06-08",181.53497592749929]
["1999-06-09",161.42735768903992]
["1999-06-10",150.09912206173888]
["1999-06-11",143.8685924667233]
["1999-06-12",167.94109317473803]
["1999-06-13",254.31888983290852]
["1999-06-14",342.67912772585669]
["1999-06-15",470.12177853299346]
["1999-06-16",509.77060322854715]
["1999-06-17",402.15236476918722]
["1999-06-18",382.32795242141037]
["1999-06-19",334.18295100538091]
["1999-06-20",273.86009629000284]
["1999-06-21",263.66468422543187]
["1999-06-22",305.8623619371283]
["1999-06-23",300.19824412347776]
["1999-06-24",351.17530444633246]
["1999-06-25",402.15236476918722]
["1999-06-26",322.85471537807985]
["1999-06-27",258.85018408382894]
["1999-06-28",225.71509487397338]
["1999-06-29",206.45709430756159]
["1999-06-30",213.25403568394222]
["1999-07-01",248.08836023789294]
["1999-07-02",266.49674313225717]
["1999-07-03",225.99830076465591]
["1999-07-04",194.27924100821298]
["1999-07-05",180.11894647408667]
["1999-07-06",210.13877088643443]
["1999-07-07",288.87000849617669]
["1999-07-08",252.90286037949588]
["1999-07-09",267.06315491362221]
["1999-07-10",334.18295100538091]
["1999-07-11",370.9997167941093]
["1999-07-12",354.00736335315776]
["1999-07-13",339.84706881903145]
["1999-07-14",322.85471537807985]
["1999-07-15",248.37156612857547]
["1999-07-16",253.1860662701784]
["1999-07-17",265.64712546020957]
["1999-07-18",248.08836023789294]
["1999-07-19",257.71736052109884]
["1999-07-20",266.49674313225717]
["1999-07-21",279.24100821297083]
["1999-07-22",252.61965448881335]
["1999-07-23",248.37156612857547]
["1999-07-24",243.27386009629001]
["1999-07-25",207.58991787029169]
["1999-07-26",197.96091758708582]
["1999-07-27",208.43953554233929]
["1999-07-28",237.60974228263947]
["1999-07-29",235.06088926649673]
["1999-07-30",230.2463891248938]
["1999-07-31",212.12121212121212]
["1999-08-01",196.54488813367317]
["1999-08-02",203.3418295100538]
["1999-08-03",234.21127159444916]
["1999-08-04",255.45171339563862]
["1999-08-05",256.86774284905124]
["1999-08-06",235.91050693854433]
["1999-08-07",214.38685924667232]
["1999-08-08",209.57235910506938]
["1999-08-09",168.22429906542055]
["1999-08-10",159.44491645426226]
["1999-08-11",153.4975927499292]
["1999-08-12",141.60294534126311]
["1999-08-13",123.1945624468989]
["1999-08-14",118.09685641461343]
["1999-08-15",115.83120928915321]
["1999-08-16",120.92891532143868]
["1999-08-17",120.07929764939111]
["1999-08-18",127.72585669781931]
["1999-08-19",139.90370999716794]
["1999-08-20",121.2121212121212]
["1999-08-21",109.88388558482016]
["1999-08-22",101.6709147550269]
["1999-08-23",93.741149815916174]
["1999-08-24",97.422826394789013]
["1999-08-25",107.90144435004248]
["1999-08-26",102.80373831775701]
["1999-08-27",86.66100254885302]
["1999-08-28",87.510620220900591]
["1999-08-29",88.926649674313225]
["1999-08-30",79.297649391107328]
["1999-08-31",73.916737468139331]
["1999-09-01",58.906825261965444]
["1999-09-02",50.410648541489664]
["1999-09-03",45.879354290569246]
["1999-09-04",44.180118946474089]
["1999-09-05",43.896913055791558]
["1999-09-06",74.483149249504393]
["1999-09-07",64.854148966298496]
["1999-09-08",50.410648541489664]
["1999-09-09",46.445766071934294]
["1999-09-10",45.029736618521667]
["1999-09-11",42.1976777116964]
["1999-09-12",39.648824695553664]
["1999-09-13",39.36561880487114]
["1999-09-14",42.764089493061455]
["1999-09-15",44.746530727839136]
["1999-09-16",43.613707165109034]
["1999-09-17",39.932030586236195]
["1999-09-18",39.932030586236195]
["1999-09-19",41.348060039648821]
["1999-09-20",43.33050127442651]
["1999-09-21",44.463324837156613]
["1999-09-22",45.312942509204191]
["1999-09-23",41.348060039648821]
["1999-09-24",36.53355989804588]
["1999-09-25",45.879354290569246]
["1999-09-26",53.525913338997448]
["1999-09-27",41.631265930331352]
["1999-09-28",34.834324553950722]
["1999-09-29",31.435853865760407]
["1999-09-30",30.303030303030301]
["1999-10-01",28.094024355706598]
["1999-10-02",26.508071367884451]
["1999-10-03",25.205324270744832]
["1999-10-04",24.214103653355988]
["1999-10-05",23.647691871990936]
["1999-10-06",23.449447748513169]
["1999-10-07",34.267912772585667]
["1999-10-08",345.51118663268193]
["1999-10-09",205.89068252619654]
["1999-10-10",103.9365618804871]
["1999-10-11",77.032002265647122]
["1999-10-12",68.535825545171335]
["1999-10-13",84.961767204757862]
["1999-10-14",83.545737751345229]
["1999-10-15",68.252619654488811]
["1999-10-16",57.774001699235342]
["1999-10-17",52.393089776267345]
["1999-10-18",48.99461908807703]
["1999-10-19",44.746530727839136]
["1999-10-20",41.914471821013876]
["1999-10-21",39.932030586236195]
["1999-10-22",37.949589351458506]
["1999-10-23",36.250354007363356]
["1999-10-24",40.498442367601243]
["1999-10-25",38.799207023506085]
["1999-10-26",53.242707448314924]
["1999-10-27",42.764089493061455]
["1999-10-28",86.66100254885302]
["1999-10-29",131.69073916737469]
["1999-10-30",129.99150382327952]
["1999-10-31",192.58000566411781]
["1999-11-01",122.91135655621636]
["1999-11-02",90.059473237043335]
["1999-11-03",75.615972812234489]
["1999-11-04",111.01670914755027]
["1999-11-05",81.846502407250071]
["1999-11-06",124.04418011894647]
["1999-11-07",127.15944491645426]
["1999-11-08",102.80373831775701]
["1999-11-09",131.69073916737469]
["1999-11-10",201.07618238459361]
["1999-11-11",233.64485981308411]
["1999-11-12",1141.3197394505805]
["1999-11-13",753.32766921551968]
["1999-11-14",453.12942509204191]
["1999-11-15",278.67459643160578]
["1999-11-16",209.28915321438686]
["1999-11-17",180.68535825545172]
["1999-11-18",146.98385726423109]
["1999-11-19",129.70829793259699]
["1999-11-20",179.55253469272159]
["1999-11-21",170.48994619088077]
["1999-11-22",136.2220334182951]
["1999-11-23",120.36250354007363]
["1999-11-24",144.15179835740582]
["1999-11-25",245.5395072217502]
["1999-11-26",198.52732936845086]
["1999-11-27",152.64797507788163]
["1999-11-28",130.55791560464456]
["1999-11-29",118.38006230529595]
["1999-11-30",160.57774001699235]
["1999-12-01",145.56782781081847]
["1999-12-02",249.50438969130556]
["1999-12-03",182.95100538091191]
["1999-12-04",137.92126876239024]
["1999-12-05",122.91135655621636]
["1999-12-06",158.31209289153213]
["1999-12-07",153.78079864061172]
["1999-12-08",120.36250354007363]
["1999-12-09",108.18465024072501]
["1999-12-10",105.63579722458226]
["1999-12-11",139.90370999716794]
["1999-12-12",270.74483149249505]
["1999-12-13",216.08609459076749]
["1999-12-14",158.59529878221466]
["1999-12-15",393.65618804871139]
["1999-12-16",506.93854432172191]
["1999-12-17",314.35853865760407]
["1999-12-18",427.64089493061454]
["1999-12-19",272.4440668365902]
["1999-12-20",197.96091758708582]
["1999-12-21",157.46247521948456]
["1999-12-22",133.95638629283488]
["1999-12-23",125.17700368167658]
["1999-12-24",122.91135655621636]
["1999-12-25",121.2121212121212]
["1999-12-26",121.2121212121212]
["1999-12-27",129.99150382327952]
["1999-12-28",145.851033701501]
["1999-12-29",137.35485698102519]
["1999-12-30",121.49532710280374]
["1999-12-31",111.01670914755027]
["2000-01-01",111.58312092891532]
["2000-01-02",103.37015009912206]
["2000-01-03",92.891532143868588]
["2000-01-04",143.8685924667233]
["2000-01-05",135.089209855565]
["2000-01-06",109.60067969413764]
["2000-01-07",97.139620504106489]
["2000-01-08",118.946474086661]
["2000-01-09",119.79609175870858]
["2000-01-10",101.10450297366185]
["2000-01-11",90.625885018408383]
["2000-01-12",82.129708297932595]
["2000-01-13",75.615972812234489]
["2000-01-14",75.049561030869441]
["2000-01-15",76.182384593599551]
["2000-01-16",73.06711979609176]
["2000-01-17",77.032002265647122]
["2000-01-18",68.535825545171335]
["2000-01-19",63.721325403568393]
["2000-01-20",61.172472387425657]
["2000-01-21",62.022090059473236]
["2000-01-22",61.738884168790712]
["2000-01-23",58.057207589917866]
["2000-01-24",55.225148683092605]
["2000-01-25",53.809119229679979]
["2000-01-26",56.074766355140184]
["2000-01-27",53.242707448314924]
["2000-01-28",51.260266213537243]
["2000-01-29",49.844236760124609]
["2000-01-30",48.145001416029451]
["2000-01-31",47.295383743981873]
["2000-02-01",110.16709147550269]
["2000-02-02",156.61285754743699]
["2000-02-03",103.37015009912206]
["2000-02-04",83.828943642027753]
["2000-02-05",72.500708014726712]
["2000-02-06",68.535825545171335]
["2000-02-07",70.518266779949016]
["2000-02-08",89.493061455678273]
["2000-02-09",103.37015009912206]
["2000-02-10",83.545737751345229]
["2000-02-11",72.783913905409236]
["2000-02-12",65.986972529028606]
["2000-02-13",61.455678278108181]
["2000-02-14",58.057207589917866]
["2000-02-15",56.074766355140184]
["2000-02-16",52.393089776267345]
["2000-02-17",49.844236760124609]
["2000-02-18",47.578589634664397]
["2000-02-19",45.879354290569246]
["2000-02-20",44.463324837156613]
["2000-02-21",47.295383743981873]
["2000-02-22",55.225148683092605]
["2000-02-23",65.13735485698102]
["2000-02-24",56.357972245822715]
["2000-02-25",51.543472104219767]
["2000-02-26",50.693854432172188]
["2000-02-27",50.977060322854712]
["2000-02-28",60.039648824695554]
["2000-02-29",58.340413480600397]
["2000-03-01",57.207589917870287]
["2000-03-02",56.641178136505239]
["2000-03-03",60.606060606060602]
["2000-03-04",76.465590484282075]
["2000-03-05",67.119796091758701]
["2000-03-06",59.473237043330499]
["2000-03-07",54.092325120362503]
["2000-03-08",50.977060322854712]
["2000-03-09",48.145001416029451]
["2000-03-10",46.16256018125177]
["2000-03-11",48.428207306711975]
["2000-03-12",46.728971962616818]
["2000-03-13",44.463324837156613]
["2000-03-14",62.871707731520814]
["2000-03-15",59.473237043330499]
["2000-03-16",64.570943075615972]
["2000-03-17",69.385443217218921]
["2000-03-18",78.164825828377232]
["2000-03-19",106.48541489662985]
["2000-03-20",79.297649391107328]
["2000-03-21",67.403001982441239]
["2000-03-22",80.430472953837437]
["2000-03-23",109.31747380345512]
["2000-03-24",85.811384876805434]
["2000-03-25",75.615972812234489]
["2000-03-26",68.252619654488811]
["2000-03-27",65.420560747663544]
["2000-03-28",69.668649107901444]
["2000-03-29",64.854148966298496]
["2000-03-30",60.322854715378078]
["2000-03-31",57.774001699235342]
["2000-04-01",60.039648824695554]
["2000-04-02",71.93429623336165]
["2000-04-03",90.625885018408383]
["2000-04-04",122.34494477485131]
["2000-04-05",110.73350325686773]
["2000-04-06",98.555649957519108]
["2000-04-07",84.961767204757862]
["2000-04-08",79.580855281789866]
["2000-04-09",88.360237892948177]
["2000-04-10",97.422826394789013]
["2000-04-11",110.45029736618521]
["2000-04-12",124.04418011894647]
["2000-04-13",141.88615123194563]
["2000-04-14",226.28150665533843]
["2000-04-15",255.73491928632114]
["2000-04-16",180.68535825545172]
["2000-04-17",143.8685924667233]
["2000-04-18",140.18691588785046]
["2000-04-19",150.38232795242141]
["2000-04-20",143.8685924667233]
["2000-04-21",143.01897479467573]
["2000-04-22",163.40979892381762]
["2000-04-23",150.09912206173888]
["2000-04-24",129.99150382327952]
["2000-04-25",115.26479750778816]
["2000-04-26",106.20220900594732]
["2000-04-27",103.08694420843953]
["2000-04-28",119.22967997734352]
["2000-04-29",107.33503256867742]
["2000-04-30",101.6709147550269]
["2000-05-01",112.99915038232795]
["2000-05-02",134.80600396488248]
["2000-05-03",167.09147550269046]
["2000-05-04",157.17926932880204]
["2000-05-05",134.80600396488248]
["2000-05-06",122.91135655621636]
["2000-05-07",108.18465024072501]
["2000-05-08",102.80373831775701]
["2000-05-09",108.18465024072501]
["2000-05-10",133.10676862078731]
["2000-05-11",119.51288586802605]
["2000-05-12",109.31747380345512]
["2000-05-13",102.52053242707449]
["2000-05-14",105.35259133389974]
["2000-05-15",129.14188615123194]
["2000-05-16",175.58765222316623]
["2000-05-17",194.84565278957803]
["2000-05-18",160.57774001699235]
["2000-05-19",183.80062305295951]
["2000-05-20",199.94335882186348]
["2000-05-21",225.71509487397338]
["2000-05-22",294.53412630982723]
["2000-05-23",252.90286037949588]
["2000-05-24",221.75021240441799]
["2000-05-25",199.94335882186348]
["2000-05-26",186.63268195978475]
["2000-05-27",224.58227131124326]
["2000-05-28",237.892948173322]
["2000-05-29",204.47465307278392]
["2000-05-30",189.46474086661001]
["2000-05-31",180.11894647408667]
["2000-06-01",165.39224015859529]
["2000-06-02",169.07391673746812]
["2000-06-03",181.25177003681677]
["2000-06-04",218.06853582554515]
["2000-06-05",297.36618521665253]
["2000-06-06",262.81506655338433]
["2000-06-07",239.30897762673462]
["2000-06-08",238.17615406400452]
["2000-06-09",230.2463891248938]
["2000-06-10",202.49221183800623]
["2000-06-11",182.38459359954686]
["2000-06-12",368.16765788728407]
["2000-06-13",365.33559898045877]
["2000-06-14",322.85471537807985]
["2000-06-15",399.32030586236192]
["2000-06-16",291.70206740300199]
["2000-06-17",279.24100821297083]
["2000-06-18",305.8623619371283]
["2000-06-19",279.80741999433587]
["2000-06-20",235.62730104786178]
["2000-06-21",255.1685075049561]
["2000-06-22",254.88530161427357]
["2000-06-23",230.2463891248938]
["2000-06-24",224.01585952987821]
["2000-06-25",231.94562446898894]
["2000-06-26",242.70744831492493]
["2000-06-27",276.97536108751063]
["2000-06-28",305.8623619371283]
["2000-06-29",303.030303030303]
["2000-06-30",263.66468422543187]
["2000-07-01",215.23647691871992]
["2000-07-02",188.89832908524497]
["2000-07-03",169.6403285188332]
["2000-07-04",163.40979892381762]
["2000-07-05",138.48768054375532]
["2000-07-06",136.2220334182951]
["2000-07-07",139.90370999716794]
["2000-07-08",161.99376947040497]
["2000-07-09",164.25941659586519]
["2000-07-10",149.81591617105636]
["2000-07-11",158.59529878221466]
["2000-07-12",172.47238742565844]
["2000-07-13",173.32200509770604]
["2000-07-14",163.69300481450014]
["2000-07-15",140.47012177853298]
["2000-07-16",142.16935712262816]
["2000-07-17",155.48003398470686]
["2000-07-18",159.44491645426226]
["2000-07-19",159.16171056357973]
["2000-07-20",162.27697536108749]
["2000-07-21",173.88841687907109]
["2000-07-22",187.19909374114982]
["2000-07-23",186.91588785046727]
["2000-07-24",153.21438685924667]
["2000-07-25",141.88615123194563]
["2000-07-26",130.27470971396204]
["2000-07-27",124.61059190031152]
["2000-07-28",123.47776833758142]
["2000-07-29",121.2121212121212]
["2000-07-30",127.72585669781931]
["2000-07-31",144.15179835740582]
["2000-08-01",145.28462192013595]
["2000-08-02",121.2121212121212]
["2000-08-03",108.18465024072501]
["2000-08-04",106.20220900594732]
["2000-08-05",110.73350325686773]
["2000-08-06",110.73350325686773]
["2000-08-07",103.65335598980458]
["2000-08-08",93.741149815916174]
["2000-08-09",91.475502690455954]
["2000-08-10",88.643443783630701]
["2000-08-11",80.430472953837437]
["2000-08-12",70.518266779949016]
["2000-08-13",64.004531294250924]
["2000-08-14",59.190031152647975]
["2000-08-15",56.924384027187763]
["2000-08-16",54.941942792410082]
["2000-08-17",53.525913338997448]
["2000-08-18",54.658736901727558]
["2000-08-19",59.190031152647975]
["2000-08-20",65.13735485698102]
["2000-08-21",53.242707448314924]
["2000-08-22",50.410648541489664]
["2000-08-23",52.109883885584821]
["2000-08-24",54.941942792410082]
["2000-08-25",56.924384027187763]
["2000-08-26",57.207589917870287]
["2000-08-27",53.525913338997448]
["2000-08-28",46.728971962616818]
["2000-08-29",43.613707165109034]
["2000-08-30",49.561030869442085]
["2000-08-31",48.428207306711975]
["2000-09-01",45.029736618521667]
["2000-09-02",41.348060039648821]
["2000-09-03",39.932030586236195]
["2000-09-04",39.082412914188616]
["2000-09-05",35.967148116680825]
["2000-09-06",35.400736335315777]
["2000-09-07",34.834324553950722]
["2000-09-08",56.924384027187763]
["2000-09-09",82.129708297932595]
["2000-09-10",106.20220900594732]
["2000-09-11",81.280090625885023]
["2000-09-12",59.190031152647975]
["2000-09-13",52.109883885584821]
["2000-09-14",48.99461908807703]
["2000-09-15",55.225148683092605]
["2000-09-16",52.676295666949869]
["2000-09-17",50.127442650807133]
["2000-09-18",58.906825261965444]
["2000-09-19",88.077032002265639]
["2000-09-20",64.570943075615972]
["2000-09-21",51.82667799490229]
["2000-09-22",44.463324837156613]
["2000-09-23",39.36561880487114]
["2000-09-24",36.250354007363356]
["2000-09-25",34.267912772585667]
["2000-09-26",32.851883319173041]
["2000-09-27",32.002265647125462]
["2000-09-28",31.435853865760407]
["2000-09-29",33.418295100538089]
["2000-09-30",238.45935995468705]

{"sheet":"TEMP","index":31,"n_rows":0,"n_cols":0,"rows_kept":0,"cut":false,"hidden":false,"merged":[]}