{"text_format":"1","workbook":"xlsx","n_sheets":6,"sheets":["Table 3_L","Table 1-1_Lookup","Table 1-2_Lookup","Table 1-3_Lookup","Flood Q Regression Tool","Flood Q Ratio Tool"],"not_rendered":{"charts":0,"images":2,"macros":1,"external_links":0,"defined_names":4,"comments":1,"pivot_tables":0},"unopened":[],"bounds":{"document_bytes":16777216,"sheet_cells":100000,"rows_first":2000,"rows_last":500,"rows_between":2000,"halvings":0,"cell_chars":16384,"cell_head_chars":4096},"cells_cut":0,"cells_raw":0,"read":"whole","date_system":"1900"}

{"sheet":"Table 3_L","index":0,"n_rows":8,"n_cols":7,"rows_kept":8,"cut":false,"hidden":true,"merged":[[0,0,0,6],[1,0,1,6],[2,1,2,2],[2,3,2,4],[2,5,2,6]]}
["Table 3.  Ranges of values of basin characteristics used to develop regional regression equations."]
["[A,  contributing drainage area, in square miles; P, mean annual precipitation, in inches; SLP50, percent of basin with slope greater than 50 percent; Min, minimum; Max, maximum; --, not used in regression equations for indicated region]"]
[null,"A",null,"P",null,"SLP50"]
["Hydrologic region\n(ordered clockwise from northwestern Montana)","Min","Max","Min","Max","Min","Max"]
["West",{"$f":"MIN('Table 1-2_Lookup'!F6:F58)","v":6.4},{"$f":"MAX('Table 1-2_Lookup'!F6:F58)","v":2516},"--","--",{"$f":"MIN('Table 1-2_Lookup'!H6:H58)","v":1.869},{"$f":"MAX('Table 1-2_Lookup'!H6:H58)","v":67.474000000000004}]
["Northwest",{"$f":"MIN('Table 1-2_Lookup'!F60:F85)","v":7.74},{"$f":"MAX('Table 1-2_Lookup'!F60:F85)","v":1556},{"$f":"MIN('Table 1-2_Lookup'!G60:G85)","v":20.742000000000001},{"$f":"MAX('Table 1-2_Lookup'!G60:G85)","v":83.156000000000006},{"$f":"MIN('Table 1-2_Lookup'!H60:H85)","v":5.7000000000000002E-2},{"$f":"MAX('Table 1-2_Lookup'!H60:H85)","v":65.94}]
["Upper Yellowstone-Central Mountain",{"$f":"MIN('Table 1-2_Lookup'!F87:F135)","v":28.1},{"$f":"MAX('Table 1-2_Lookup'!F87:F135)","v":2616},{"$f":"MIN('Table 1-2_Lookup'!G87:G135)","v":16.454000000000001},{"$f":"MAX('Table 1-2_Lookup'!G87:G135)","v":38.847000000000001},"--","--"]
["Southwest",{"$f":"MIN('Table 1-2_Lookup'!F137:F160)","v":24.4},{"$f":"MAX('Table 1-2_Lookup'!F137:F160)","v":2472},{"$f":"MIN('Table 1-2_Lookup'!G137:G160)","v":16.738},{"$f":"MAX('Table 1-2_Lookup'!G137:G160)","v":37.018000000000001},{"$f":"MIN('Table 1-2_Lookup'!H137:H160)","v":0.96199999999999997},{"$f":"MAX('Table 1-2_Lookup'!H137:H160)","v":22.553000000000001}]

{"sheet":"Table 1-1_Lookup","index":1,"n_rows":165,"n_cols":58,"rows_kept":165,"cut":false,"hidden":true,"merged":[[138,0,138,57],[88,0,88,57],[61,0,61,57],[0,0,0,41],[1,0,1,41],[2,4,2,57],[7,0,7,57]]}
["Table 1–2.  Streamflow characteristics for streamflow-gaging stations used in developing the regional regression equations."]
["[NR, not reported]"]
["Map number\n(fig. 1)","Station identification","Station name","Analysis period of record, in water years","Streamflow for inidcated streamflow characteristic (Q),\nin cubic feet per second"]
[null,null,null,null,"QAL7Q10","QS214Q5","QA0.2","QA0.5","QA0.8","QAMEAN","QJAN0.2","QJAN0.5","QJAN0.8","QJANMEAN","QFEB0.2","QFEB0.5","QFEB0.8","QFEBMEAN","QMAR0.2","QMAR0.5","QMAR0.8","QMARMEAN","QAPR0.2","QAPR0.5","QAPR0.8","QAPRMEAN","QMAY0.2","QMAY0.5","QMAY0.8","QMAYMEAN","QJUN0.2","QJUN0.5","QJUN0.8","QJUNMEAN","QJUL0.2","QJUL0.5","QJUL0.8","QJULMEAN","QAUG0.2","QAUG0.5","QAUG0.8","QAUGMEAN","QSEP0.2","QSEP0.5","QSEP0.8","QSEPMEAN","QOCT0.2","QOCT0.5","QOCT0.8","QOCTMEAN","QNOV0.2","QNOV0.5","QNOV0.8","QNOVMEAN","QDEC0.2","QDEC0.5","QDEC0.8","QDECMEAN"]
[]
[null,null,null,null,{"$f":"RIGHT(E4,LEN(E4)-1)","v":"AL7Q10"},{"$f":"RIGHT(F4,LEN(F4)-1)","v":"S214Q5"},{"$f":"RIGHT(G4,LEN(G4)-1)","v":"A0.2"},"A0.5","A0.8","AMEAN",{"$f":"RIGHT(K4,LEN(K4)-1)","v":"JAN0.2"},"JAN0.5","JAN0.8","JANMEAN","FEB0.2","FEB0.5","FEB0.8","FEBMEAN","MAR0.2","MAR0.5","MAR0.8","MARMEAN","APR0.2","APR0.5","APR0.8","APRMEAN",{"$f":"RIGHT(AA4,LEN(AA4)-1)","v":"MAY0.2"},"MAY0.5","MAY0.8","MAYMEAN","JUN0.2","JUN0.5","JUN0.8","JUNMEAN","JUL0.2","JUL0.5","JUL0.8","JULMEAN","AUG0.2","AUG0.5","AUG0.8","AUGMEAN",{"$f":"RIGHT(AQ4,LEN(AQ4)-1)","v":"SEP0.2"},"SEP0.5","SEP0.8","SEPMEAN","OCT0.2","OCT0.5","OCT0.8","OCTMEAN","NOV0.2","NOV0.5","NOV0.8","NOVMEAN","DEC0.2","DEC0.5","DEC0.8","DECMEAN"]
[null,null,null,null,18,119,230,227,224,415,245,242,239,416,260,257,254,417,275,272,269,418,290,287,284,419,305,302,299,420,320,317,314,421,335,332,329,422,350,347,344,423,365,362,359,424,380,377,374,425,395,392,389,426,410,407,404,427]
["West hydrologic region"]
[596,12301300,"Tobacco River near Eureka, Montana","1959–2009",37.594999999999999,56.110999999999997,415,147,66,263,130,90,63,102,130,97,57,109,191,124,87,156,599,340,186,415,1020,687,471,756,980,700,433,727,443,253,149,298,170,114,71,122,137,102,70,107,139,103,76,112,157,110,81,131,137,96,71,113]
[605,12301999,"Wolf Creek near Libby, Montana","1968–77","","",75,33,15,70,19,11,5.7,22,37,14,6.6,27,69,33,16,69,479,136,51,263,463,262,117,296,122,65,37,82,36,22,11,30,14,12,7.4,11,12,9.1999999999999993,6.9,9.1999999999999993,12,10,8.6,11,13,11,8.6,11,15,9.6,7.9,12]
[607,12302055,"Fisher River near Libby, Montana","1968–2009",57.314,73.902000000000001,735,255,121,468,323,201,99,248,351,224,117,327,758,379,187,570,1740,940,532,1180,1930,1190,731,1380,1160,745,354,799,402,236,142,281,176,128,86,134,140,112,81,114,155,117,93,131,273,161,89,223,283,160,87,234]
[609,12302500,"Granite Creek near Libby, Montana","1933, 1937–43, 1961–69",5.3710000000000004,6.4589999999999996,115,53,24,71,26,19,13,20,35,17,9.3000000000000007,26,42,23,15,31,153,84,44,116,325,216,135,234,306,210,125,224,104,57,34,72,29,21,12,22,24,13,7.5,18,41,19,8.6,27,46,25,12,33,47,31,15,39]
[611,12303100,"Flower Creek near Libby, Montana","1961–92",3.8370000000000002,4.9169999999999998,37,13,6.9,26,14,9.8000000000000007,5.7,9.1,12,7.3,4.7,9.3000000000000007,15,9,5.4,11,43,22,12,31,123,73,41,84,125,81,46,88,43,23,13,29,13,9.6,6.8,10,9.8000000000000007,7.7,6.1,8.4,12,8,5.5,9.1,16,8.8000000000000007,5.2,13,14,10,6,10]
[614,12303500,"Lake Creek at Troy, Montana","1945–57, 1983–96",76.084000000000003,102.337,649,258,131,428,331,188,113,232,364,203,114,286,451,266,166,305,850,559,312,611,1590,1120,722,1190,1460,966,551,1030,607,352,233,438,255,197,151,206,175,148,123,148,212,143,106,177,358,216,112,270,382,207,124,280]
[615,12304040,"Basin Creek near Yaak, Montana","1990–2000","",6.48,47,16,8.4,32,11,7.2,4.9000000000000004,9.6999999999999993,13,8.1,5.4,12,20,12,7.4,15,83,36,22,53,178,101,64,122,133,72,38,85,43,26,17,30,17,13,8.8000000000000007,14,11,8.8000000000000007,7.1,9.5,12,8.4,6.8,9.4,16,10,6.5,16,17,8.6999999999999993,5.4,16]
[621,12304500,"Yaak River near Troy, Montana","1956–2009",68.602999999999994,93.623999999999995,1260,376,177,836,386,242,127,291,469,254,134,344,845,421,202,601,2750,1540,821,1900,4780,3070,1950,3450,2830,1580,817,1870,683,394,240,479,250,178,121,190,195,143,103,157,225,158,114,192,414,216,116,312,412,228,118,311]
[624,12323240,"Blacktail Creek at Butte, Montana","1989–2009",4.7539999999999996,5.5410000000000004,17,9.6999999999999993,6.1,13,9.9,8.1,7.2,8.6,12,9.3000000000000007,6.9,10,17,12,8.4,14,23,15,11,18,29,18,11,21,32,16,9.1999999999999993,23,14,8.9,6.8,12,12,8.4,6.2,9.4,11,8.3000000000000007,6.4,8.9,12,9.9,7.5,10,12,9.6,7.7,10,11,8.4,7.2,8.9]
[627,12323500,"German Gulch Creek near Ramsay, Montana","1956–69",3.6739999999999999,6.8330000000000002,24,11,5.7,21,7.9,6.4,5.4,6.6,8.1,6.4,5.2,6.8,9.8000000000000007,7.1,5.0999999999999996,8.5,25,14,9.6999999999999993,18,95,56,34,65,112,66,39,76,32,19,13,23,14,11,7.9,11,11,9.3000000000000007,7.6,9.6,12,8.6999999999999993,7.4,9.4,9.9,8,6.7,8.1,9.6,7,5.8,7.5]
[628,12323600,"Silver Bow Creek at Opportunity, Montana","1988–2009",12.337,13.983000000000001,66,41,22,51,42,30,24,34,57,43,28,45,63,43,32,52,83,56,42,65,127,85,48,98,143,79,40,100,65,33,21,43,39,22,15,28,39,27,21,30,44,34,26,35,46,34,26,35,41,28,23,32]
[633,12324100,"Racetrack Creek below Granite Creek, near Anaconda, Montana","1958–72",14.489000000000001,23.992000000000001,88,33,16,61,23,20,17,20,23,20,18,20,22,19,17,20,32,23,20,27,162,87,42,103,289,226,155,230,130,98,79,108,88,70,53,71,55,43,33,44,41,29,26,33,30,24,21,25,25,21,17,22]
[634,12324200,"Clark Fork at Deer Lodge, Montana","1979–2009",25.716000000000001,34.195999999999998,330,218,128,251,267,206,157,217,278,214,167,235,310,234,192,255,336,256,194,272,516,329,191,383,781,379,176,493,354,135,59,209,145,82,41,102,234,143,96,165,299,214,156,230,310,229,179,243,271,207,161,217]
[636,12324590,"Little Blackfoot River near Garrison, Montana","1973–2009",12.986000000000001,18.925000000000001,225,143,61,152,76,58,36,62,93,65,37,81,145,89,63,118,336,171,110,228,711,401,194,481,597,298,131,390,187,105,58,131,85,49,26,60,75,48,29,55,91,68,47,71,89,65,53,71,72,56,36,63]
[642,12330000,"Boulder Creek at Maxville, Montana","1939–2009",5.31,6.9909999999999997,51,29,13,45,22,18,15,19,21,19,15,18,21,18,15,19,35,22,17,28,173,89,45,116,256,155,82,173,82,45,22,58,29,17,11,21,24,16,9.3000000000000007,18,30,22,14,23,28,22,18,24,25,21,16,21]
[646,12331800,"Clark Fork near Drummond, Montana","1993–2009",122.36,152.53800000000001,885,561,379,694,604,473,365,491,683,533,332,569,784,586,460,669,1040,664,540,803,1600,1050,642,1200,2350,1270,697,1550,1010,484,299,679,506,279,189,355,579,370,249,424,708,561,464,580,709,560,476,585,605,480,402,497]
[648,12332000,"Middle Fork Rock Creek near Philipsburg, Montana","1938–2009",14.352,34.484000000000002,149,49,23,118,39,31,24,32,39,32,24,33,43,34,27,36,100,55,36,74,497,274,147,337,673,426,258,474,239,144,87,174,89,65,47,69,62,49,39,52,55,45,37,49,50,40,33,43,43,34,27,36]
[649,12334510,"Rock Creek near Clinton, Montana","1973–2009",73.402000000000001,163.09,657,284,128,517,222,170,124,184,215,177,137,189,299,214,173,244,738,388,247,508,2120,1210,763,1500,2500,1440,777,1680,897,544,340,657,414,284,195,308,330,261,179,261,291,242,192,248,265,216,178,228,232,181,137,196]
[653,12335500,"Nevada Creek above reservoir, near Helmville, Montana","1939–2009",3.0939999999999999,4.9329999999999998,46,30,13,35,19,12,6,12,25,16,7.6,16,44,21,11,34,92,47,20,66,171,84,37,110,136,65,27,88,36,23,12,27,20,12,7.3,14,14,9.1,6,10,18,13,8.6,14,18,14,10,15,17,12,5.7,12]
[654,12338300,"North Fork Blackfoot River above Dry Gulch, near Ovando, Montana","1998–2009",73.515000000000001,131.53800000000001,481,175,108,369,122,102,92,109,115,93,84,101,129,100,82,113,538,232,129,354,1710,1060,724,1300,1650,1060,720,1190,512,349,268,418,253,213,183,219,197,170,155,174,176,151,137,155,176,138,110,159,147,117,102,127]
[655,12338500,"Blackfoot River near Ovando, Montana","1941–63",154.40899999999999,306.28199999999998,1060,454,236,855,329,269,219,274,328,267,223,287,361,295,239,341,1060,545,316,721,3790,2110,973,2460,4150,2780,1560,3000,1540,941,623,1140,651,488,390,526,463,383,325,397,449,365,309,395,439,355,297,377,388,301,252,324]
[659,12338690,"Monture Creek near Ovando, Montana","1974–83","","",269,74,40,192,64,36,30,47,62,37,30,44,70,50,30,56,331,130,66,211,984,586,328,668,1090,670,401,746,335,193,112,247,103,81,64,83,67,56,43,55,51,45,39,46,46,41,37,46,42,38,33,45]
[661,12339450,"Clearwater River near Clearwater, Montana","1975–92",25.152999999999999,31.472999999999999,449,109,52,281,114,79,62,92,114,76,59,86,194,123,68,160,1030,529,200,648,1410,904,612,1010,1030,703,344,701,364,182,91,233,111,70,40,76,85,54,36,65,102,71,52,80,140,80,62,100,123,80,67,105]
[663,12340000,"Blackfoot River near Bonner, Montana","1900–01, 1903–05, 1940–2009",285.18599999999998,472.31799999999998,2150,740,393,1560,672,529,414,555,680,530,414,595,966,647,498,786,3060,1580,907,2060,7040,4180,2730,4850,6650,4340,2470,4710,2380,1460,930,1730,1010,782,565,804,791,655,494,654,734,616,494,643,759,605,504,652,711,547,440,603]
[669,12343400,"East Fork Bitterroot River near Conner, Montana","1956–72, 2001–4",41.182000000000002,76.344999999999999,336,126,64,281,101,79,65,84,102,80,69,89,142,95,76,112,342,206,133,257,1380,793,486,940,1570,1010,541,1080,398,244,168,293,160,119,95,127,136,107,87,113,134,106,86,113,121,100,81,102,108,85,63,89]
[675,12346500,"Skalkaho Creek near Hamilton, Montana","1949–53, 1958–79, 2001–3",16.516999999999999,31.675999999999998,114,42,24,91,31,25,21,26,28,25,21,25,29,25,21,26,73,39,27,52,367,187,96,232,490,386,214,373,190,121,84,147,83,63,50,67,56,45,37,47,47,39,32,41,41,34,29,35,34,28,24,29]
[676,12347500,"Blodgett Creek near Corvallis, Montana","1947–69",2.3679999999999999,3.7080000000000002,109,24,10,70,22,11,7.2,15,20,13,7.7,15,21,15,9.6,18,112,50,27,75,360,241,127,254,362,258,168,269,143,70,35,91,29,20,10,21,23,11,5.6,17,41,17,6.5,27,40,18,9.4,26,32,17,8.1,22]
[678,12350000,"Bear Creek near Victor, Montana","1938–54, 1958–59",1.4350000000000001,2.3370000000000002,101,25,10,66,17,12,6.6,13,16,11,6.8,12,17,12,9.1999999999999993,16,123,60,25,81,363,228,120,252,344,217,134,243,130,56,24,84,18,10,5.9,13,14,6.4,2.9,11,34,14,6.5,22,33,15,7.8,22,31,13,6.1,19]
[681,12350500,"Kootenai Creek near Stevensville, Montana","1949–53, 1958–63","","",124,28,12,79,17,12,8.6,13,26,13,8.8000000000000007,19,22,18,12,19,126,61,31,84,360,209,120,246,413,287,186,309,184,99,51,125,34,19,11,24,24,13,7.7,18,61,27,11,40,51,24,12,33,32,15,9.9,21]
[682,12351000,"Burnt Fork Bitterroot River near Stevensville, Montana","1920, 1939–62",7.1829999999999998,15.085000000000001,60,22,9.8000000000000007,48,19,17,14,17,20,16,13,16,19,16,13,17,63,31,18,42,214,108,62,141,251,166,95,180,87,50,35,66,37,29,21,30,25,22,18,22,25,20,17,22,26,20,17,22,24,19,16,20]
[683,12351200,"Bitterroot River near Florence, Montana","1958–65, 2003–9",397.22800000000001,443.71,2750,944,523,2130,1050,706,584,807,1070,774,654,883,1180,838,701,1000,2800,1890,1160,2220,9060,5160,3160,6270,10900,7600,4260,7780,2870,1400,690,1960,887,620,516,715,1120,735,554,918,1190,868,636,1040,1380,942,628,1120,1180,811,619,937]
[685,12352000,"Lolo Creek above Sleeman Creek, near Lolo, Montana","1951–60","","","","","","",119,60,46,77,108,70,53,91,128,88,57,101,535,302,134,372,1070,816,516,838,864,638,395,652,321,175,87,211,72,48,24,50,59,39,18,43,"","","","",134,74,40,89,120,65,45,87]
[690,12353280,"Ninemile Creek near Huson, Montana","1974–83","","",195,56,29,132,60,42,24,54,59,34,25,48,146,84,36,109,435,224,95,271,677,458,257,479,504,296,170,339,144,95,61,104,53,39,28,42,40,34,25,33,35,31,26,31,36,31,27,32,53,31,25,43]
[695,12354000,"St. Regis River near St. Regis, Montana","1911–14, 1959–75, 2002–9",64.313999999999993,80.762,850,282,137,541,343,231,119,259,368,204,135,277,574,312,183,421,1620,1050,601,1190,2890,1810,1180,2090,2160,1200,585,1420,497,291,191,378,184,146,108,150,141,112,91,117,154,113,93,132,252,142,89,199,287,145,81,205]
[698,12355000,"Flathead River at Flathead, British Columbia","1929–39, 1941–95, 2000–9",85.245000000000005,167.53,1200,414,199,889,248,158,120,192,216,154,114,174,236,178,120,208,1390,552,228,896,4990,3100,1830,3460,4470,2660,1500,3020,1330,769,480,949,478,343,251,376,347,254,195,289,405,241,158,329,476,259,144,348,294,197,143,236]
[718,12363920,"Stillwater River at Olney, Montana","1973–82","","",228,75,44,148,62,40,32,51,64,42,34,48,76,49,40,59,258,139,78,180,562,396,278,421,600,446,259,473,282,193,109,210,141,98,63,99,86,71,45,70,64,58,43,55,68,54,45,57,64,48,42,53]
[720,12365000,"Stillwater River near Whitefish, Montana","1931–50, 1973–2006",47.402000000000001,67.275999999999996,539,159,73,355,143,97,72,123,144,102,74,124,215,128,89,163,1010,492,230,660,1590,1050,590,1150,1220,784,430,857,539,318,179,372,241,165,92,174,164,124,76,125,138,109,74,113,153,114,82,127,142,97,74,121]
[722,12366000,"Whitefish River near Kalispell, Montana","1929–50, 1973–2006",23.332000000000001,28.413,294,104,47,190,94,58,43,72,90,59,42,70,127,84,58,97,329,188,112,227,705,490,357,527,805,598,375,606,392,228,132,272,151,103,64,109,111,78,50,81,92,66,43,70,88,69,47,72,96,59,45,72]
[724,12367500,"Ashley Creek near Kalispell, Montana","1931–32, 1934–50, 1973–74",0,0,42,17,4.9000000000000004,34,12,4.0999999999999996,0.71,8,16,2.9,0.23,7.4,26,14,3.1,18,121,34,17,67,178,54,27,109,142,44,26,78,53,26,14,36,22,9.5,1.7,14,14,4.4000000000000004,0.39,7.2,12,4,0.46,6.3,13,5,0.98,7.3,11,3.7,0.45,6]
[725,12369200,"Swan River near Condon, Montana","1973–92",21.591000000000001,29.696000000000002,271,77,39,159,64,45,32,52,59,44,33,49,91,58,37,72,309,176,76,209,552,384,248,414,644,440,318,486,393,236,119,269,145,87,57,100,88,61,41,69,77,52,34,58,89,56,40,69,75,48,38,62]
[728,12370000,"Swan River near Bigfork, Montana","1922–2009",272.47000000000003,347.54700000000003,1770,682,370,1130,593,442,357,496,594,436,339,496,826,538,391,637,2080,1300,792,1500,3670,2600,1780,2800,4210,3120,2200,3270,2260,1400,891,1610,891,644,470,687,643,495,380,531,644,500,375,545,713,536,403,595,670,492,382,562]
[731,12371100,"Hell Roaring Creek near Polson, Montana","1917–32",2.3439999999999999,3.2320000000000002,7,5,3.7,6.7,5.4,4.5,3.6,4.7,5.4,4.4000000000000004,3.7,4.5,5.2,4,3.3,4.3,9,5.2,3.7,7.2,21,8.6999999999999993,5.0999999999999996,13,24,10,5.0999999999999996,14,9,5.6,4,7.3,7.2,5.6,4.3,5.8,6.5,5.2,4.0999999999999996,5.3,6.5,4.7,3.8,5,6.1,5.0999999999999996,4.2,5.2,6,5,4.2,5.3]
[733,12374250,"Mill Creek above Bassoo Creek, near Niarada, Montana","1983–2009",1.383,1.72,11,5,2.5,7.9,3.9,2.5,1.5,3.4,4.0999999999999996,2.7,1.7,3.6,8.9,3.9,2.4,6.9,29,12,6.5,20,34,19,12,26,21,12,6.5,15,7.1,4.5,3,5.4,3.8,2.8,2.1,3,2.9,2.4,1.9,2.4,2.9,2.4,2,2.5,3.8,2.7,1.9,3.4,3.7,2.6,1.8,3.4]
[738,12377150,"Mission Creek above reservoir, near St. Ignatius, Montana","1983–2009",6.62,15.506,76,22,11,48,12,10,8.6999999999999993,11,11,8.9,7.7,9.1999999999999993,13,9.9,8.3000000000000007,10,34,18,10,24,153,83,36,101,229,158,115,174,155,102,64,113,60,43,30,48,37,27,20,30,32,24,17,25,25,18,14,20,16,13,10,13]
[739,12378000,"Mission Creek near St. Ignatius, Montana","1907–17","",28.875,"","","","","","","","",17,13,11,14,16,14,11,14,37,21,14,29,133,77,36,88,311,228,152,273,284,202,118,204,110,83,57,88,73,53,39,55,51,45,34,44,44,32,26,34,31,25,18,24]
[740,12381400,"South Fork Jocko River near Arlee, Montana","1983–2009",3.7559999999999998,16.067,83,30,13,58,17,11,7.6,13,15,11,7.4,11,21,14,9,17,90,40,18,56,281,171,105,201,284,180,113,201,99,71,49,78,47,38,28,38,32,26,20,27,25,20,17,21,22,17,13,19,19,13,8.9,15]
[741,12383500,"Big Knife Creek near Arlee , Montana","1911, 1913, 1915, 1983–2009",2.9239999999999999,6.66,14,7.6,4.9000000000000004,10,5.9,5,4.2,5,5.0999999999999996,4.4000000000000004,3.9,4.5,5.2,4.3,3.8,4.5,8,5.3,4.2,6.1,23,13,8,16,37,27,18,28,25,18,14,20,15,12,11,13,12,10,8.4,10,9.4,8.1999999999999993,6.9,8.1,7.8,6.9,5.7,6.8,6.8,5.7,4.9000000000000004,5.8]
[742,12387450,"Valley Creek near Arlee, Montana","1983–2008","",6.6429999999999998,"","","","","","","","","","","","","","","","",19,11,7.5,14,43,27,20,32,38,24,15,28,17,13,9.6,14,12,9.9,7.6,10,10,9,7,8.9,9.5,8.3000000000000007,6.7,8.3000000000000007,"","","","","","","",""]
[743,12388200,"Jocko River at Dixon, Montana","1990–2009",87.664000000000001,138.89500000000001,251,182,112,232,158,129,115,138,153,124,111,134,171,136,119,150,298,184,142,225,632,339,216,438,868,489,264,581,324,205,159,259,199,172,143,174,205,185,153,183,208,183,155,184,204,174,147,181,181,149,129,158]
[744,12388400,"Revais Creek below West Fork, near Dixon, Montana","1983–2009",3.15,4.2919999999999998,23,10,5.4,18,6.8,4.8,3.8,5.5,6.3,4.7,3.8,5.6,9.8000000000000007,5.8,4.3,8.1,34,16,7.8,22,95,54,34,69,81,47,26,55,20,14,10,16,9.4,7.7,6.3,7.9,7.5,6,4.8,6.2,7.5,5.7,4.5999999999999996,6.2,8.1,5.9,4.7,6.7,7.2,5.3,3.9,6.5]
[748,12389500,"Thompson River near Thompson Falls, Montana","1911, 1956–2009",90.599000000000004,135.08199999999999,604,231,122,433,268,164,102,202,304,180,108,242,428,269,180,345,1120,622,358,774,1790,1150,706,1310,1420,902,474,996,523,360,240,396,289,231,166,233,231,191,143,190,207,175,138,178,232,174,136,195,244,173,130,201]
[749,12390700,"Prospect Creek at Thompson Falls, Montana","1956–2009",30.553000000000001,39.33,369,154,75,234,186,124,63,117,199,122,62,154,300,165,90,220,690,405,230,485,1120,697,448,794,789,462,225,526,200,133,97,158,99,82,64,82,73,63,48,61,62,51,40,53,134,93,52,79,144,87,49,110]
[755,12391550,"Bull River near Noxon, Montana","1973–82","","",610,210,101,389,300,171,92,261,275,171,104,246,380,256,187,300,736,435,272,531,1470,1010,697,1080,1430,893,535,1030,598,322,183,396,205,148,106,155,140,117,93,118,120,102,88,103,198,120,92,157,369,189,93,282]
["Northwest hydrologic region"]
[2,5011000,"Belly River near Mountain View, Alberta","1912–78",22.178000000000001,67.141999999999996,515,283,117,314,85,61,45,68,82,62,36,68,82,59,41,69,299,143,79,207,1150,710,405,786,1490,1010,669,1120,822,535,346,603,340,246,159,260,232,149,98,177,245,142,85,178,173,117,73,128,108,80,53,86]
[3,5011500,"Waterton River near international boundary","1947–63","",36.795000000000002,417,91,41,274,44,31,23,36,40,25,18,32,35,24,17,27,192,58,27,129,1250,786,337,820,1500,1050,720,1140,796,402,219,520,173,116,81,130,121,73,52,99,239,110,43,161,130,77,43,94,82,46,31,59]
[4,5012500,"Boundary Creek at international boundary","1948–63","",12.949,123,30,14,78,21,13,8.8000000000000007,15,16,11,7.3,13,14,12,6.8,11,60,24,11,41,325,201,100,212,368,279,188,284,192,108,73,137,61,43,31,47,42,26,19,35,73,34,16,50,44,28,17,32,26,18,12,21]
[6,5013700,"St. Mary River above Swiftcurrent Creek, near Babb, Montana","1902–15","",179.80799999999999,"","","","","","","","","","","","","","","","",326,161,97,237,1440,900,512,1000,2530,1770,1240,1980,1680,1140,834,1300,760,627,463,633,578,345,270,406,505,282,210,345,414,216,134,269,"","","",""]
[9,5014500,"Swiftcurrent Creek at Many Glacier, Montana","1913, 1915–34, 1936–2009",8.0579999999999998,29.81,236,104,42,140,42,24,14,33,35,22,14,27,42,23,12,32,154,70,31,104,559,337,172,375,657,452,302,485,348,224,151,257,150,105,75,115,106,70,48,84,110,62,32,84,95,59,24,74,49,31,17,37]
[10,5015000,"Canyon Creek near Many Glacier, Montana","1918, 1921–23, 1925, 1928–34, 1936","",5.476,"","","","","","","","","","","","","","","","","","","","",91,52,27,60,98,67,44,74,51,34,23,38,24,18,13,19,19,12,7.6,13,17,11,7.1,16,"","","","","","","",""]
[14,5020500,"St. Mary River at international boundary","1903–10, 1912–16","",305.69299999999998,"","","","","","","","","","","","","","","","",939,581,279,647,2650,1760,1200,1910,4900,3090,2210,3680,2780,1900,1390,2140,1300,985,716,1030,873,598,436,678,838,581,402,630,664,416,282,476,"","","",""]
[112,6073000,"Dearborn River near Clemons, Montana","1921–23, 1929–32, 1934–53",10.509,11.587,161,79,36,131,46,29,23,33,43,31,23,33,43,32,24,37,197,68,31,129,554,322,156,375,683,346,144,451,187,82,31,123,68,35,18,47,52,27,14,35,60,41,22,44,60,37,28,46,55,33,25,41]
[129,6078500,"North Fork Sun River near Augusta, Montana","1946–68, 1989–92, 2008",36.170999999999999,80.328999999999994,712,455,198,363,80,64,53,66,78,63,52,66,80,63,52,68,383,164,78,271,1900,1160,585,1270,2090,1350,757,1470,659,371,241,487,212,162,128,172,151,114,95,129,150,105,83,122,122,91,73,100,102,74,60,82]
[131,6080000,"Sun River near Augusta, Montana","1905–22, 1924–25","",164.18899999999999,"","","","","","","","",281,195,134,224,356,185,132,239,1180,473,239,742,3730,2330,1370,2650,5240,3050,1700,3660,1680,979,569,1270,612,392,264,452,443,316,243,344,386,316,208,305,414,283,175,310,300,227,146,231]
[133,6081500,"Willow Creek near Augusta, Montana","1905–25",1.2330000000000001,4.6349999999999998,41,26,10,36,15,8.6999999999999993,5.0999999999999996,12,25,16,6.8,19,21,13,5.5,16,35,20,11,24,79,48,22,67,124,58,22,99,56,26,9.5,39,29,14,3,18,20,10,4.7,13,22,14,7.6,15,18,13,9.1999999999999993,14,14,9.3000000000000007,5.3,11]
[134,6084500,"Elk Creek at Augusta, Montana","1905–08, 1910–19, 1921–24","",4.3559999999999999,"","","","","","","","","","","","","","","","",97,58,33,69,386,178,55,262,552,238,86,385,167,68,26,105,67,34,12,45,61,31,9,34,68,42,23,48,"","","","","","","",""]
[149,6092000,"Two Medicine River near Browning, Montana","1910–11, 1913–24, 1951–77",2.9660000000000002,9.3989999999999991,1130,707,284,361,110,66,36,79,114,72,45,88,177,92,42,135,764,345,152,475,1860,1250,808,1400,2200,1170,473,1450,599,271,112,383,139,69,27,91,142,65,24,101,205,92,40,131,171,84,47,112,142,71,32,92]
[150,6092500,"Badger Creek near Browning, Montana","1951–73",36.076000000000001,93.884,544,348,153,229,103,85,61,83,104,90,70,92,109,89,73,96,233,136,94,179,923,601,349,651,1090,649,373,753,369,245,181,287,189,154,125,158,147,123,105,128,157,122,109,132,136,113,87,112,122,97,69,95]
[158,6098500,"Cut Bank Creek near Browning, Montana","1920, 1922, 1991–2007, 2009",9.4960000000000004,16.102,196,91,40,123,41,28,21,34,42,27,19,37,70,43,24,59,196,106,58,133,577,335,196,399,685,415,255,475,256,141,75,172,85,49,23,55,59,35,19,39,75,43,28,56,81,58,34,69,48,33,24,41]
[178,6102500,"Teton River below South Fork, near Choteau, Montana","1948–54, 1998–2001, 2004–8","",57.679000000000002,"","","","","","","","","","","","","","","","",95,66,49,78,457,245,130,312,630,333,210,447,302,147,99,208,133,97,73,106,98,79,63,82,87,73,58,75,"","","","","","","",""]
[268,6132200,"South Fork Milk River near Babb, Montana","1961–2007, 2009","",2.7469999999999999,"","","","","","","","","","","","",38,17,7.5,31,89,49,25,63,122,60,31,82,175,109,43,86,53,27,10,35,26,14,4.5,17,21,11,4.7,14,23,15,8.1999999999999993,17,"","","","","","","",""]
[272,6133500,"North Fork Milk River above St. Mary Canal, near Browning, Montana","1929, 1931, 1933, 1936–37, 1939–46, 1950, 1952–53, 1956, 1961, 1965–2009","",6.45,"","","","","","","","","","","","",31,21,10,23,49,32,15,36,46,30,13,33,39,25,12,30,26,15,7.3,19,23,13,7.7,16,25,14,6.3,17,24,15,10,17,"","","","","","","",""]
[651,12335000,"Blackfoot River near Helmville, Montana","1941–53",71.613,128.96199999999999,430,193,104,352,139,121,95,119,138,119,95,121,142,116,100,125,358,174,113,271,1530,798,298,970,1790,1130,605,1260,676,415,267,500,298,222,168,235,206,171,144,173,191,161,123,159,178,150,124,149,155,134,103,132]
[700,12355500,"North Fork Flathead River near Columbia Falls, Montana","1911–17, 1931–32, 1934–2009",327.83800000000002,667.26400000000001,4550,1710,787,2960,982,659,476,775,876,646,486,737,1160,767,504,922,4910,2490,1150,3250,13400,8820,5680,9710,13800,9270,5620,9970,5520,3350,2100,3990,2070,1460,1080,1600,1410,1030,823,1150,1450,957,749,1160,1530,1020,519,1230,1130,771,564,912]
[704,12357000,"Middle Fork Flathead River at Essex, Montana","1940–53, 1956–64",84.692999999999998,152.934,1480,897,386,1090,287,195,127,223,303,197,128,238,318,209,150,251,1970,896,394,1320,6130,4080,2360,4350,5640,3240,1730,3790,1460,744,447,1040,410,304,227,326,285,225,189,244,500,243,165,357,492,277,155,355,493,248,151,333]
[708,12358500,"Middle Fork Flathead River near West Glacier, Montana","1940–2000, 2005–9",279.291,469.90800000000002,4640,2380,1050,2890,954,615,358,736,901,578,370,720,1130,688,413,893,4750,2390,1180,3190,13700,8750,5400,9630,13900,9340,5930,10000,5640,3270,1950,3910,1760,1250,882,1350,1170,809,613,934,1450,803,512,1070,1760,949,481,1230,1240,725,389,938]
[711,12359800,"South Fork Flathead River above Twin Creek, near Hungry Horse, Montana","1965–82, 1985–2005, 2007–8",178.88200000000001,287.66000000000003,3460,925,443,2310,610,370,216,479,628,380,227,520,729,473,301,588,3890,1830,853,2490,11100,6760,4010,7710,11800,7290,4380,8190,3900,2000,1120,2630,1000,690,481,759,652,456,338,559,715,469,302,573,975,529,296,706,614,409,255,514]
[712,12360000,"Twin Creek near Hungry Horse, Montana","1949–56, 1965–67","","",177,52,23,124,35,20,13,23,32,21,15,27,38,27,14,31,323,152,58,205,766,482,318,545,592,355,192,385,127,65,38,87,29,22,16,23,19,13,9.9,18,47,24,10,31,49,31,12,35,44,27,14,36]
[713,12361000,"Sullivan Creek near Hungry Horse, Montana","1949–56, 1960–76",17.725999999999999,24.779,338,101,46,225,88,48,26,64,86,47,28,69,93,54,37,75,403,199,97,272,1180,770,477,837,1130,725,454,797,282,153,91,197,75,54,39,60,68,40,27,59,129,54,29,89,143,75,35,96,109,62,29,80]
[714,12361500,"Graves Creek near Hungry Horse, Montana","1949–56, 1965–67","","",206,60,26,135,41,27,19,31,35,24,15,31,36,24,19,29,175,82,34,117,643,393,198,429,722,504,331,532,295,146,71,193,51,34,24,41,47,24,16,33,109,40,17,63,97,53,23,60,66,42,21,54]
["Upper Yellowstone-Central Mountain hydrologic region"]
[77,6043000,"Taylor Creek near Grayling, Montana","1946–53, 1955–56, 1967","",23.573,"","","","","","","","","","","","","","","","","","","","",398,195,75,243,550,404,280,422,275,162,109,191,85,59,44,68,49,38,32,40,38,30,24,33,29,24,20,24,"","","",""]
[80,6043500,"Gallatin River near Gallatin Gateway, Montana","1930–69, 1972–81, 1985–2009",203.845,340.61900000000003,1010,424,252,805,343,292,250,298,340,288,251,294,351,293,257,305,621,414,314,500,2640,1570,860,1800,3900,2720,1770,2890,1700,1040,686,1260,726,556,449,595,568,460,382,477,529,425,360,442,442,364,298,371,362,303,255,309]
[84,6048000,"East Gallatin River at Bozeman, Montana","1940–61",18.763999999999999,27.696999999999999,107,49,26,85,46,38,30,39,47,40,31,42,69,49,35,60,209,128,70,158,324,210,124,236,257,152,82,178,81,55,38,63,54,39,28,42,58,46,37,49,60,51,43,52,58,50,42,50,52,45,36,46]
[85,6048500,"Bridger Creek near Bozeman, Montana","1946–69, 1971–72, 1987",2.282,5.2859999999999996,51,19,8.3000000000000007,37,10,6.2,4.3,7.2,10,7.4,4.2,8.9,19,10,5,15,89,48,23,64,216,131,77,154,146,83,46,101,43,26,16,31,18,12,7.5,13,13,9.4,6.6,11,14,9.4,7.4,11,14,9.3000000000000007,7,10,13,7.4,5.2,8.8000000000000007]
[87,6050000,"Hyalite Creek at Hyalite Ranger Station, near Bozeman, Montana","1935–50",10.712,22.675000000000001,91,35,19,62,25,20,16,21,22,20,16,19,21,17,14,17,63,30,17,47,187,131,79,143,252,188,135,196,138,85,51,97,57,41,32,44,45,33,25,35,41,30,22,32,33,26,19,26,26,20,15,21]
[88,6052500,"Gallatin River at Logan, Montana","1903–05, 1929–2009",223.35300000000001,268.5,1230,766,514,1060,790,680,569,681,815,680,549,695,922,748,618,790,1320,952,712,1040,3020,1780,1090,2100,4270,2710,1380,2890,1550,613,301,990,606,424,303,478,823,580,404,629,987,758,561,774,984,839,665,832,878,746,610,748]
[122,6077000,"Sheep Creek near White Sulphur Springs, Montana","1942–72",4.875,11.670999999999999,42,16,8.1999999999999993,32,12,9.1,7,9.1999999999999993,11,8.8000000000000007,7.2,9.1,11,8.6999999999999993,7,9.3000000000000007,28,14,9.6999999999999993,21,140,79,41,95,156,98,62,115,57,39,29,43,29,22,17,23,22,17,14,18,18,15,12,16,15,13,10,13,12,10,8,10]
[125,6077500,"Smith River near Eden, Montana","1951–69, 2006–8",14.282999999999999,49.012,450,249,101,338,150,82,47,99,181,120,72,137,252,148,91,184,532,296,183,388,1360,790,419,938,1690,852,490,1140,524,278,158,355,224,128,74,149,177,113,72,145,185,136,95,163,185,128,90,150,142,96,55,110]
[143,6090500,"Belt Creek near Monarch, Montana","1951–82",5.3849999999999998,36.149000000000001,340,213,86,192,39,28,18,29,42,30,18,31,47,30,19,36,190,77,36,127,991,559,292,697,1270,638,303,819,318,179,103,226,125,82,58,91,87,62,44,74,83,56,38,68,63,45,31,50,47,33,20,35]
[190,6109800,"South Fork Judith River near Utica, Montana","1959–79",2.0150000000000001,4.97,34,21,9.1,23,4.8,3.8,3,3.9,4.5,3.9,3.4,4,5.5,4,3.2,5.0999999999999996,31,12,5.8,21,159,79,38,104,103,53,24,73,32,20,12,23,15,11,7.4,12,10,8.1999999999999993,5.7,8.4,8.1999999999999993,6.6,5.0999999999999996,6.8,6.4,5.4,3.9,5.3,5.4,4.4000000000000004,3.5,4.4000000000000004]
[192,6110000,"Judith River near Utica, Montana","1920–29, 1934–75",0.40100000000000002,4.7450000000000001,70,39,16,57,4.7,3.1,1.8,3.3,3.2,2.1,1.2,2.2999999999999998,3.6,2.2000000000000002,0.89,2.5,27,9.6999999999999993,3.9,25,321,154,47,193,419,228,98,271,131,66,26,85,44,23,11,29,25,14,6.9,17,19,11,5.0999999999999996,13,13,8.9,4.7,10,8.3000000000000007,5.5,3.2,6.3]
[193,6111000,"Ross Fork Creek near Hobson, Montana","1946–53, 1955–62","",0,52,28,4.9000000000000004,14,3,1.6,0.87,2.1,6.5,3,1.1000000000000001,4.9000000000000004,73,27,11,63,61,25,10,49,55,35,14,27,38,23,8.6,24,6.3,2.9,0.74,3.9,1.7,0.5,0,1.1000000000000001,0.77,9.0444444444444452E-3,0,0.44,2,0.65,0,0.97,3.3,1.8,0.81,2.1,3.3,2.1,1.4,2.7]
[197,6114500,"Wolf Creek near Stanford, Montana","1950–53, 1955–58, 1960–62","",1.32,"","","","","","","","","","","","",3.8,2.4,1.2,2.4,5.0999999999999996,3.1,1.3,3.3,5.3,4,1.8,4.5,17,11,4.7,25,9.5,6.6,2.4,6.9,7.7,4.9000000000000004,2.2000000000000002,5,6.3,3.9,1.7,4,5.8,4.0999999999999996,1.5,3.7,4.9000000000000004,3.3,1.4,3.2,4.0999999999999996,2.2000000000000002,1.4,2.7]
[205,6115500,"North Fork Musselshell River near Delpine, Montana","1940–78",2.5569999999999999,3.4740000000000002,17,8.5,4.2,12,7.1,5.5,4.4000000000000004,5.7,7.6,5.7,4.3,6.3,11,6.1,3.5,9.1999999999999993,26,15,8.6,19,40,24,12,27,43,28,14,29,20,13,7.5,14,13,8.6999999999999993,4.9000000000000004,9,10,7.3,4,7.4,9.4,6.7,4.0999999999999996,7,8.9,7.2,5.6,7.4,7.6,6.2,4.7,6.4]
[209,6118500,"South Fork Musselshell River above Martinsdale, Montana","1942–79",1.389,4.2910000000000004,153,96,38,91,23,18,10,18,25,18,12,20,45,22,12,35,169,84,39,112,515,269,134,334,556,308,118,365,121,58,22,80,39,19,9.8000000000000007,25,33,19,8.9,23,40,28,16,31,35,26,18,28,29,21,10,22]
[212,6120500,"Musselshell River at Harlowton, Montana","1909–32, 1934–55",0,0,170,79,26,137,74,44,26,50,73,50,24,54,151,72,36,128,327,161,70,218,746,352,102,459,876,395,101,535,221,87,25,145,90,35,4.5,54,84,42,3.6,53,116,65,21,72,117,74,38,79,93,53,28,64]
[217,6121000,"American Fork near Harlowton, Montana","1908, 1911, 1913, 1924–32","",0,"","","","","","","","","","","","","","","","",6.6,4.0999999999999996,2,5.9,88,18,5.5,46,166,44,11,93,11,1.9,0,8.8000000000000007,2.5,0,0,1.6,3.6,0.36,0,1.7,5.9,3.6,1.4,4.0999999999999996,"","","","","","","",""]
[218,6121500,"Lebo Creek near Harlowton, Montana","1909–11, 1913, 1924–31","",1.431,"","","","","","","","","","","","","","","","",22,16,8.6,16,26,15,4.8,18,28,8.1,2.2999999999999998,16,11,4.9000000000000004,2.1,7.6,14,7.1,2.8,8.4,19,13,3.8,12,20,16,9.5,15,"","","","","","","",""]
[219,6122000,"American Fork below Lebo Creek, near Harlowton, Montana","1946–67",0.25600000000000001,1.468,43,27,11,31,17,13,7.8,13,21,15,9.1999999999999993,17,27,18,10,23,32,20,13,23,112,42,13,70,204,75,25,130,39,19,7.5,30,16,8.1,3.9,10,16,8.5,3.9,12,20,11,4.7,13,20,14,8.3000000000000007,15,19,13,8.8000000000000007,15]
[423,6191000,"Gardner River near Mammoth, Yellowstone National Park, Wyoming","1939–72, 1984–2009",71.063999999999993,104.46,249,127,78,213,106,96,84,96,100,92,84,93,102,93,84,94,171,114,93,141,735,447,256,511,976,642,395,695,394,251,172,296,191,152,124,159,159,132,113,135,144,123,107,126,127,110,96,111,114,101,88,101]
[424,6191500,"Yellowstone River at Corwin Springs, Montana","1911–32, 1934–2009",500.92599999999999,1104.489,4670,1410,768,3140,1010,800,646,822,1000,807,646,823,1050,885,728,893,1890,1270,967,1570,9270,5390,2760,6250,15000,10700,7370,11500,9210,6020,3840,6690,4080,2920,2100,3120,2380,1870,1460,1920,1820,1440,1160,1500,1400,1160,928,1180,1130,933,755,941]
[426,6193000,"Shields River near Wilsall, Montana","1935–57",4.9180000000000001,7.81,79,40,17,63,15,11,7.5,11,15,10,7.7,11,14,11,7.9,12,94,31,13,61,320,175,94,221,360,197,105,242,98,42,26,63,27,18,13,21,21,14,9.1999999999999993,16,23,17,12,19,21,15,11,16,17,13,9.5,14]
[427,6193500,"Shields River at Clyde Park, Montana","1921–23, 1929–32, 1934–67",7.5910000000000002,10.776999999999999,230,89,37,164,57,42,33,46,69,45,26,57,121,79,37,103,374,185,102,252,684,410,218,485,779,440,183,507,213,94,37,133,67,37,15,47,78,44,20,54,91,61,40,70,84,64,46,66,68,48,34,53]
[428,6194000,"Brackett Creek near Clyde Park, Montana","1921–23, 1934–35, 1938–57",1.996,4.5259999999999998,43,16,6.7,30,9.3000000000000007,6.1,4.3,7.1,9,6.2,4,7.2,12,8.1,4.0999999999999996,11,68,31,14,46,146,87,53,102,112,65,35,77,41,24,12,28,16,9.1999999999999993,5.6,11,13,9.6,6.2,9.8000000000000007,13,9.8000000000000007,7.4,11,12,8.8000000000000007,6.2,9.8000000000000007,11,6.7,5,8.4]
[430,6197000,"Big Timber Creek near Big Timber, Montana","1912–16, 1918–23","",12.481,"","","","","","","","","","","","","","","","",66,43,25,48,234,116,67,145,407,278,176,310,258,149,76,176,77,47,29,56,44,32,21,35,43,29,17,31,33,26,19,25,"","","",""]
[431,6197500,"Boulder River near Contact, Montana","1910–15, 1951–69, 1971–74, 1982–83",39.901000000000003,84.617999999999995,484,153,72,375,70,62,53,63,64,57,51,58,61,55,49,55,116,77,50,101,1040,518,198,679,2670,1800,1130,1930,1420,825,489,994,380,235,168,277,190,145,117,158,175,127,90,133,114,91,73,94,87,70,60,73]
[432,6200000,"Boulder River at Big Timber, Montana","1947–53, 1955–2009",38.484999999999999,60.268000000000001,608,227,97,554,163,130,98,134,150,124,99,126,144,123,105,127,258,172,121,212,1810,874,375,1150,3740,2480,1540,2710,1870,947,383,1240,364,177,91,235,269,155,77,182,282,203,141,214,232,185,147,189,188,154,112,152]
[433,6200500,"Sweet Grass Creek above Melville, Montana","1919–21, 1937–69",4.5759999999999996,21.913,121,41,17,86,18,13,9.4,14,14,12,8.1999999999999993,12,13,10,7.4,11,23,17,9.8000000000000007,17,301,131,36,178,523,343,217,385,284,176,109,204,98,65,48,74,55,41,29,44,54,33,24,41,39,28,19,29,25,18,12,18]
[434,6201000,"Sweet Grass Creek below Melville, Montana","1908–10, 1913, 1916, 1918, 1921–24, 1937–42, 1946–52","",14.756,117,48,21,89,36,27,20,28,30,21,17,24,39,25,15,30,53,35,23,44,280,122,45,174,502,315,168,361,267,130,59,170,78,48,22,57,66,40,23,47,88,64,35,66,70,55,30,52,55,42,27,41]
[440,6202510,"Stillwater River above Nye Creek, near Nye, Montana","1980–91",30.71,81.003,471,154,72,373,68,54,44,56,61,52,43,52,58,49,42,51,185,90,51,138,1210,628,205,781,2650,1660,950,1810,1410,666,406,912,364,283,199,294,204,160,119,169,149,121,84,127,106,81,62,88,78,63,47,63]
[442,6204500,"Rosebud Creek near Absarokee, Montana","1935–69",74.739000000000004,170.749,582,242,116,405,180,146,118,149,170,143,116,149,207,151,116,165,271,192,131,212,722,427,256,526,1630,1050,709,1200,1410,961,648,1060,611,431,292,464,391,296,220,310,292,240,190,246,233,202,167,200,198,166,133,166]
[443,6205000,"Stillwater River near Absarokee, Montana","1911–13, 1935–98, 2000–9",139.702,330.45800000000003,1280,448,212,932,333,275,216,280,312,263,213,268,346,255,199,283,520,353,257,408,2290,1180,640,1510,4720,3150,2040,3440,3180,2060,1230,2310,1190,785,539,879,769,567,401,601,623,497,391,514,475,407,334,404,378,318,249,317]
[445,6207500,"Clarks Fork Yellowstone River near Belfry, Montana","1922–23, 1926–32, 1934–2009",71.978999999999999,110.354,1260,362,163,928,282,235,195,241,263,231,196,233,256,221,187,232,544,300,215,424,3250,1620,671,2070,5650,3670,2360,4080,3230,1850,952,2180,878,497,275,598,433,257,153,303,380,245,150,271,369,285,210,293,321,264,212,267]
[447,6207800,"Bluewater Creek near Bridger, Montana","1960–70","",23.341999999999999,30,28,26,28,31,30,27,29,31,29,27,29,31,29,28,29,31,29,28,29,30,28,27,28,29,27,25,28,29,25,24,26,28,26,25,26,30,27,26,28,30,28,27,28,31,29,27,29,31,29,27,29]
[450,6209500,"Rock Creek near Red Lodge, Montana","1932, 1934–82, 1985–86, 2000–9",19.864999999999998,57.823999999999998,273,84,41,168,39,34,28,33,34,31,25,30,33,28,24,29,44,35,27,39,332,147,62,217,797,513,330,577,625,435,309,482,311,237,183,253,176,135,102,140,98,75,62,80,64,53,44,54,47,40,33,41]
[451,6210000,"West Fork Rock Creek below Basin Creek, near Red Lodge, Montana","1938–56","",27.545000000000002,"","","","","","","","","","","","","","","","","","","","",172,88,46,120,377,255,163,277,325,220,164,246,148,108,82,118,79,63,48,64,46,37,30,40,"","","","","","","",""]
[453,6211000,"Red Lodge Creek above Cooney Reservoir, near Boyd, Montana","1937–42, 1944–48, 1950–2008","",12.093,"","","","","","","","","","","","","","","","",114,59,33,74,223,113,45,153,278,158,70,185,129,71,34,88,55,32,19,39,66,41,22,46,60,44,29,47,44,32,23,33,"","","",""]
[454,6211500,"Willow Creek near Boyd, Montana","1937–2004, 2006–8","",15.526,"","","","","","","","","","","","","","","","",47,26,15,33,70,33,13,47,77,48,20,55,71,55,36,55,52,38,25,39,47,34,24,36,37,29,23,30,27,22,17,22,"","","",""]
[460,6216000,"Pryor Creek at Pryor, Montana","1922–23, 1967–2009",6.306,8.4009999999999998,55,35,16,30,34,26,20,28,34,27,21,29,37,27,22,30,39,27,22,31,68,46,23,51,53,29,15,39,30,18,10,22,28,18,10,19,32,23,15,25,38,29,21,30,36,28,21,30,35,27,20,29]
[464,6216900,"Pryor Creek near Huntley, Montana","1979–2000",0.85699999999999998,2.843,78,46,19,63,63,44,30,51,77,52,32,66,128,67,35,103,112,66,44,86,169,70,34,126,107,57,27,74,49,17,5.7,31,37,17,5.5,22,45,30,18,32,62,46,33,50,62,48,34,50,64,46,34,49]
[471,6287500,"Soap Creek near St. Xavier, Montana","1913, 1939–53, 1968–72",5.7190000000000003,11.71,41,27,11,31,27,19,13,22,39,21,13,31,61,33,18,45,53,36,21,41,56,33,18,48,56,32,18,46,34,24,12,25,26,19,12,19,26,20,13,21,28,23,17,24,27,24,16,22,24,19,14,19]
[472,6288000,"Rotten Grass Creek near St. Xavier, Montana","1913–17, 1919, 1968–72","",3.1589999999999998,"","","","","","","","","","","","","","","","","","","","",69,38,16,54,67,29,11,50,27,17,6.7,22,14,7.9,2.8,8.8000000000000007,12,9.3000000000000007,4.5999999999999996,9.1,14,9.6999999999999993,6.5,11,"","","","","","","",""]
[473,6288200,"Beauvais Creek near St. Xavier, Montana","1967–77","",4.2590000000000003,28,18,7.4,24,13,7.1,3.1,9.8000000000000007,18,9.5,4.2,16,30,15,8.1999999999999993,23,60,27,12,47,140,34,18,72,64,27,14,45,23,13,6.8,18,13,8.5,4.3,9.8000000000000007,12,7.1,4.5,8.6999999999999993,27,18,8.9,15,26,17,8.1999999999999993,12,8.5,6.1,3.6,6.4]
[475,6289000,"Little Bighorn River at State line, near Wyola, Montana","1939–2009",35.319000000000003,69.231999999999999,177,82,43,148,73,62,52,62,69,61,53,61,69,60,54,61,94,73,60,84,489,272,138,327,752,436,262,509,277,190,129,215,148,117,92,121,115,95,79,97,99,83,71,85,87,73,62,74,79,67,56,67]
[477,6290000,"Pass Creek near Wyola, Montana","1935–56, 1983–2009",0,2.0150000000000001,71,44,18,35,23,15,9.9,17,33,18,9.4,23,53,29,15,38,71,40,23,50,134,73,40,97,136,66,27,87,42,20,7.5,26,20,8.5,3,12,19,10,4.8,12,22,17,10,17,23,17,13,18,21,15,11,16]
[479,6290500,"Little Bighorn River below Pass Creek, near Wyola, Montana","1939–58, 1960–75, 1977–2004",37.792000000000002,57.816000000000003,232,149,67,202,124,101,79,104,137,102,77,114,161,116,92,139,230,157,110,181,658,393,200,458,946,517,281,626,320,188,106,228,149,107,67,111,139,103,71,107,144,122,97,121,136,118,100,118,125,104,84,106]
[480,6291000,"Owl Creek near Lodge Grass, Montana","1939–45, 1980–92",0.111,0.20699999999999999,15,9.4,3.6,9.9,7.9,5.3,3.1,6,11,6.7,3.2,14,34,12,5,24,23,12,5.8,17,22,12,5.0999999999999996,20,22,14,5.7,16,6.9,3.4,1.1000000000000001,4.7,3.8,1.1000000000000001,0.19,2.1,3.7,1.6,0.26,2.1,5.2,3.3,1.4,3.7,6.5,4,2.1,4.5,8,5.5,3.3,6.3]
[481,6291500,"Lodge Grass Creek above Willow Creek diversion, near Wyola, Montana","1939–74, 1983–2009",5.7030000000000003,13.055999999999999,57,25,12,47,20,16,11,16,21,16,11,17,25,18,13,20,42,25,11,31,178,96,48,118,295,161,88,193,85,53,32,62,38,25,17,28,29,21,14,22,26,20,15,21,23,18,14,19,20,16,12,16]
[484,6294000,"Little Bighorn River near Hardin, Montana","1953–2009",11.393000000000001,29.201000000000001,517,323,129,272,170,124,84,136,222,145,98,192,364,207,134,299,392,240,154,302,942,461,190,596,1280,654,295,812,372,171,72,253,168,105,50,115,181,118,57,124,194,150,105,151,184,147,109,149,167,125,94,132]
["Southwest hydrologic region"]
[15,6006000,"Red Rock Creek above Lakes, near Lakeview, Montana","1997–98, 2000–8","",17.32,"","","","","","","","","","","","","","","","",35,23,17,27,88,46,31,60,131,90,44,95,78,45,28,55,47,32,21,34,38,26,19,28,30,23,17,24,"","","","","","","",""]
[16,6011000,"Red Rock River at Kennedy Ranch, near Lakeview, Montana","1936–66","",14.7,"","","","","","","","","","","","","","","","",569,266,66,329,535,335,208,380,337,228,145,243,151,82,41,101,66,41,21,45,62,40,23,43,86,61,40,64,88,60,39,59,"","","",""]
[20,6013500,"Big Sheep Creek below Muddy Creek, near Dell, Montana","1946–53, 1961–79",30.300999999999998,40.259,81,54,41,65,49,42,37,43,47,40,36,42,53,43,36,49,115,70,49,89,117,74,45,86,146,92,49,102,95,65,45,71,84,66,52,67,67,53,42,55,74,63,49,62,66,57,46,57,55,48,40,48]
[25,6015500,"Grasshopper Creek near Dillon, Montana","1921–33, 1946–53, 1955–58, 1960–61",5.1660000000000004,4.3760000000000003,72,37,16,55,33,24,18,25,34,26,18,27,59,34,21,49,95,69,47,73,166,87,51,113,235,105,42,137,61,29,14,40,40,20,9.1,25,29,15,8.3000000000000007,19,47,36,22,35,48,39,31,39,38,25,20,29]
[29,6017500,"Blacktail Deer Creek near Dillon, Montana","1946–53, 1955–66",13.518000000000001,30.167999999999999,67,46,30,54,37,30,20,30,43,33,20,33,54,41,29,43,67,53,44,56,105,72,53,80,168,117,77,128,93,67,44,70,58,46,34,47,55,44,35,45,55,44,36,46,51,42,32,42,40,33,25,33]
[33,6019500,"Ruby River above reservoir, near Alder, Montana","1938–2009",60.728999999999999,75.897000000000006,221,113,64,180,114,102,89,103,113,100,91,102,123,105,90,110,198,138,109,163,594,351,218,417,691,405,229,468,259,161,108,193,147,113,86,120,141,110,92,115,142,120,103,122,137,119,106,122,122,108,97,110]
[39,6024450,"Big Hole River below Big Lake Creek, at Wisdom, Montana","1988–2008","",8.6790000000000003,"","","","","","","","","","","","","","","","",486,299,170,369,769,327,111,482,901,323,90,539,321,94,32,187,75,32,12,56,55,30,16,38,88,58,39,67,"","","","","","","",""]
[40,6024500,"Trail Creek near Wisdom, Montana","1948–53, 1967–72","",14.682,"","","","","","","","","","","","","","","","",135,45,20,81,612,438,163,409,545,276,144,340,82,56,38,62,32,24,19,26,26,19,15,21,25,21,17,22,24,19,15,21,"","","",""]
[41,6024540,"Big Hole River below Mudd Creek, near Wisdom, Montana","1998–99, 2001–8","",54.96,"","","","","","","","","","","","","","","","",1120,627,345,800,2180,1190,671,1470,2220,1160,559,1410,469,231,137,333,173,107,60,124,151,104,73,116,230,162,124,176,"","","","","","","",""]
[42,6024590,"Wise River near Wise River, Montana","1973–85",23.225999999999999,45.66,190,78,39,183,49,39,35,42,42,38,34,39,43,38,34,39,126,61,36,88,787,376,174,508,1230,831,461,858,410,200,106,279,129,88,63,99,102,73,51,79,86,63,46,68,69,50,38,54,55,44,36,46]
[45,6025500,"Big Hole River near Melrose, Montana","1924–2009",125.952,168.89500000000001,1460,478,220,1120,415,332,256,339,425,333,272,354,555,404,324,478,2190,1090,589,1470,4700,2650,1540,3240,5820,3460,1630,3860,1850,975,500,1270,656,384,223,451,504,308,214,364,635,441,311,484,598,461,345,487,471,360,283,386]
[46,6026000,"Birch Creek near Glen, Montana","1946–53, 1955–76",2.3540000000000001,7.6319999999999997,44,13,5.9,29,9.9,7.8,6.2,8,8.5,7.4,5.6,7.3,9.8000000000000007,7.5,5.8,8,16,9.8000000000000007,7.2,12,82,38,18,53,155,109,73,115,84,60,42,67,45,24,14,29,16,12,9.4,13,23,16,12,17,15,11,7.1,11,11,7.9,5,8]
[54,6030500,"Boulder River above Rock Creek, near Basin, Montana","1946–53, 1955–57","",1.3080000000000001,"","","","","","","","","","","","","","","","","","","","",73,44,18,50,47,26,14,35,12,5.5,3.1,7.8,3.3,2.1,1.5,2.5,2.8,2,1.6,2.2000000000000002,2.9,2.2000000000000002,1.7,2.4,2.7,2.2000000000000002,1.6,2.2000000000000002,"","","",""]
[56,6033000,"Boulder River near Boulder, Montana","1929–32, 1934–72, 1985–2009",6.3479999999999999,8.7590000000000003,149,59,24,116,34,26,18,26,37,29,20,30,58,36,27,48,248,114,58,165,678,370,217,459,645,325,146,407,141,64,24,94,43,22,9,31,35,21,12,28,51,31,19,36,46,32,23,35,37,27,20,28]
[60,6035000,"Willow Creek near Harrison, Montana","1938–2002, 2004–9",2.6240000000000001,2.8719999999999999,54,31,14,41,32,25,18,26,35,26,20,29,38,30,24,31,54,39,27,41,92,52,22,62,175,90,33,110,101,35,9.9,59,18,7.3,3.1,12,34,11,4.5,19,48,28,8.6999999999999993,29,45,36,21,34,39,31,24,32]
[62,6036500,"Willow Creek near Willow Creek, Montana","1920–32","",11.536,"","","","","","","","","","","","",53,41,32,45,69,53,34,53,125,86,47,91,204,85,51,118,78,44,29,57,35,24,14,26,36,24,12,28,50,35,24,38,60,39,24,40,"","","",""]
[74,6040300,"Jack Creek near Ennis, Montana","1974–86, 1991",9.2609999999999992,19.164000000000001,64,24,13,47,17,15,13,15,15,14,12,13,15,13,12,14,47,26,15,33,172,88,54,111,216,154,99,163,105,68,44,77,50,36,28,39,35,27,23,29,29,23,20,24,25,19,16,20,19,17,14,17]
[91,6055500,"Crow Creek near Radersburg, Montana","1919–28, 1966–72","",9.891,"","","","","","","","","","","","",14,10,7.4,11,44,22,12,33,245,143,73,167,248,133,75,168,76,44,25,54,30,20,15,23,22,17,12,17,22,17,12,17,19,14,9.9,14,13,9.5,7.7,10]
[97,6061500,"Prickly Pear Creek near Clancy, Montana","1910–11, 1913–15, 1923–33, 1946–53, 1955–69, 1979–2002, 2006–9",7.7519999999999998,11.750999999999999,69,45,20,44,25,19,13,20,28,21,12,22,39,26,17,29,68,44,30,51,146,96,47,107,179,103,57,124,80,43,25,55,42,24,15,29,38,23,16,28,38,26,18,29,34,25,18,27,27,21,15,22]
[101,6062500,"Tenmile Creek near Rimini, Montana","1917, 1921, 1923, 1926–29, 1934–94, 1997–2009",7.5999999999999998E-2,0.219,59,37,15,16,1.9,0.99,0.47,1.3,1.4,0.9,0.48,1.1000000000000001,2.7,1.3,0.52,2.2000000000000002,27,9.6999999999999993,3.3,18,128,63,26,80,116,49,17,70,19,6.5,2.6,12,3.7,1.2,0.49,2.4,3,1.2,0.47,2.1,4.2,1.5,0.57999999999999996,2.8,3.1,1.1000000000000001,0.46,2.1,2.1,1,0.47,1.6]
[103,6063000,"Tenmile Creek near Helena, Montana","1909–28, 1930–54, 1997–98",8.8999999999999996E-2,0.186,32,19,7.1,29,8.8000000000000007,5.0999999999999996,2.4,6,7.6,4.8,2.5,5.7,14,6.8,3.2,10,55,24,9.1,36,175,80,39,115,182,64,19,105,31,9.3000000000000007,3.3,19,4.3,1.5,0.33,3.3,5.8,1.4,0.4,3.4,14,5.6,1.9,8.6999999999999993,13,7.2,3.5,8.8000000000000007,9.9,4.5999999999999996,2.2999999999999998,6.2]
[106,6068500,"Little Prickly Pear Creek near Marysville, Montana","1914, 1916–25, 1927–32","","","","","","","","","","","","","","",12,7.3,5.0999999999999996,9.6,48,20,11,30,127,71,38,87,115,56,30,78,41,29,17,32,25,19,12,19,18,15,9.1999999999999993,14,"","","","","","","","","","","",""]
[107,6071000,"Little Prickly Pear Creek near Canyon Creek, Montana","1909–11, 1913–16, 1918–24","",0.89900000000000002,"","","","","","","","","","","","","","","","",119,66,40,83,289,167,67,189,221,92,17,111,47,13,4.3,32,23,6.8,2.1,13,30,18,7.7,20,34,20,13,22,37,27,20,28,"","","",""]
[109,6071300,"Little Prickly Pear Creek at Wolf Creek, Montana","1962–67, 1992–2009",15.048,20.274000000000001,98,65,31,85,56,43,30,44,60,43,26,56,81,58,42,65,181,91,65,128,373,161,75,227,281,143,63,194,106,61,37,75,55,39,24,43,54,36,26,45,52,42,33,48,62,49,38,52,59,47,34,48]
[]
["2Flood-frequency results not reported because of too many values less than the low-outlier threshold used in the analysis. This is discussed further in McCarthy and others (2015)."]

{"sheet":"Table 1-2_Lookup","index":2,"n_rows":160,"n_cols":8,"rows_kept":160,"cut":false,"hidden":true,"merged":[[85,0,85,7],[135,0,135,7],[1,0,1,7],[0,0,0,7],[2,5,2,7],[4,0,4,7],[58,0,58,7],[2,3,2,4]]}
["Table 1–3.  Basin-characteristics data for streamflow-gaging stations used in developing the regional regression equations."]
["[A,  contributing drainage area, in square miles; P, mean annual precipitation, in inches;  --, not applicable; SLP50, percent of basin with slope greater than 50 percent]"]
[null,null,null,"Gage location",null,"Basin-characteristics data"]
["Map number (fig. 1)","Station identification","Station name","Latitude, decimal degrees1","Longitude, decimal degrees1","A","P","SLP50"]
["West hydrologic region"]
[596,12301300,"Tobacco River near Eureka, Montana",48.893591669999999,-115.08785278000001,419,"--",12.401999999999999]
[605,12301999,"Wolf Creek near Libby, Montana",48.23356716,-115.28488348,216,"--",5.7670000000000003]
[607,12302055,"Fisher River near Libby, Montana",48.355602779999998,-115.31465,842,"--",11.186]
[609,12302500,"Granite Creek near Libby, Montana",48.301802780000003,-115.59236667,23.7,"--",56.671999999999997]
[611,12303100,"Flower Creek near Libby, Montana",48.344838889999998,-115.60656944,11.2,"--",44.42]
[614,12303500,"Lake Creek at Troy, Montana",48.44686111,-115.87713611,204,"--",34.610999999999997]
[615,12304040,"Basin Creek near Yaak, Montana",48.930547220000001,-115.48163056,27.5,"--",6.0620000000000003]
[621,12304500,"Yaak River near Troy, Montana",48.56172222,-115.97015833,792,"--",7.3949999999999996]
[624,12323240,"Blacktail Creek at Butte, Montana",45.994669440000003,-112.53571389,90.9,"--",4.8339999999999996]
[627,12323500,"German Gulch Creek near Ramsay, Montana",46.014600000000002,-112.79324722,40.9,"--",8.6920000000000002]
[628,12323600,"Silver Bow Creek at Opportunity, Montana",46.107758330000003,-112.80528332999999,343,"--",4.6500000000000004]
[633,12324100,"Racetrack Creek below Granite Creek, near Anaconda, Montana",46.278944439999997,-112.919175,41.1,"--",22.882999999999999]
[634,12324200,"Clark Fork at Deer Lodge, Montana",46.397649999999999,-112.74253889000001,1001,"--",7.2229999999999999]
[636,12324590,"Little Blackfoot River near Garrison, Montana",46.51948333,-112.79317222,414,"--",2.3940000000000001]
[642,12330000,"Boulder Creek at Maxville, Montana",46.471652779999999,-113.23576944,70.5,"--",15.986000000000001]
[646,12331800,"Clark Fork near Drummond, Montana",46.711913889999998,-113.33078055999999,2516,"--",6.0259999999999998]
[648,12332000,"Middle Fork Rock Creek near Philipsburg, Montana",46.184569439999997,-113.50156944,121,"--",13.96]
[649,12334510,"Rock Creek near Clinton, Montana",46.722336110000001,-113.68306111,889,"--",21.175999999999998]
[653,12335500,"Nevada Creek above reservoir, near Helmville, Montana",46.777777780000001,-112.76778611,119,"--",13.933999999999999]
[654,12338300,"North Fork Blackfoot River above Dry Gulch, near Ovando, Montana",46.979494440000003,-113.09218611,310,"--",25.007999999999999]
[655,12338500,"Blackfoot River near Ovando, Montana",47.015558329999998,-113.22881667,1270,"--",14.218]
[659,12338690,"Monture Creek near Ovando, Montana",47.045291669999997,-113.19016388999999,146,"--",27.059000000000001]
[661,12339450,"Clearwater River near Clearwater, Montana",47.018677779999997,-113.3877,346,"--",9.157]
[663,12340000,"Blackfoot River near Bonner, Montana",46.899411110000003,-113.75631944,2287,"--",12.837999999999999]
[669,12343400,"East Fork Bitterroot River near Conner, Montana",45.883016670000004,-114.06631389,380,"--",17.824999999999999]
[675,12346500,"Skalkaho Creek near Hamilton, Montana",46.160794439999997,-113.94871944,87.5,"--",28.587]
[676,12347500,"Blodgett Creek near Corvallis, Montana",46.269422220000003,-114.23705556,25.9,"--",60.2]
[678,12350000,"Bear Creek near Victor, Montana",46.38092778,-114.22041111,27.4,"--",54.484000000000002]
[681,12350500,"Kootenai Creek near Stevensville, Montana",46.53683333,-114.15956389,28.9,"--",67.146000000000001]
[682,12351000,"Burnt Fork Bitterroot River near Stevensville, Montana",46.46368056,-113.94561111,73.5,"--",21.728999999999999]
[683,12351200,"Bitterroot River near Florence, Montana",46.633088890000003,-114.05095833,2342,"--",25.202999999999999]
[685,12352000,"Lolo Creek above Sleeman Creek, near Lolo, Montana",46.744113890000001,-114.14342499999999,250,"--",22.010999999999999]
[690,12353280,"Ninemile Creek near Huson, Montana",47.063397219999999,-114.41378889000001,170,"--",14.573]
[695,12354000,"St. Regis River near St. Regis, Montana",47.296711109999997,-115.122625,304,"--",30.760999999999999]
[698,12355000,"Flathead River at Flathead, British Columbia",49.001241669999999,-114.47566389000001,429,"--",27.117999999999999]
[718,12363920,"Stillwater River at Olney, Montana",48.535480560000003,-114.57168611,162,"--",13.593999999999999]
[720,12365000,"Stillwater River near Whitefish, Montana",48.31905278,-114.38715833000001,558,"--",5.423]
[722,12366000,"Whitefish River near Kalispell, Montana",48.320186110000002,-114.27859444000001,170,"--",13.366]
[724,12367500,"Ashley Creek near Kalispell, Montana",48.164997219999997,-114.43237778,201,"--",1.869]
[725,12369200,"Swan River near Condon, Montana",47.422383330000002,-113.67097222,69.099999999999994,"--",18.991]
[728,12370000,"Swan River near Bigfork, Montana",48.024230559999999,-113.97881944,672,"--",20.835000000000001]
[731,12371100,"Hell Roaring Creek near Polson, Montana",47.702952779999997,-114.04838611,6.4,"--",18.93]
[733,12374250,"Mill Creek above Bassoo Creek, near Niarada, Montana",47.829827780000002,-114.69783332999999,19.600000000000001,"--",5.26]
[738,12377150,"Mission Creek above reservoir, near St. Ignatius, Montana",47.322822219999999,-113.97938056,12.4,"--",67.474000000000004]
[739,12378000,"Mission Creek near St. Ignatius, Montana",47.327905559999998,-114.12303889,52,"--",40.228999999999999]
[740,12381400,"South Fork Jocko River near Arlee, Montana",47.195549999999997,-113.85073611,57.6,"--",16.812000000000001]
[741,12383500,"Big Knife Creek near Arlee , Montana",47.147261110000002,-113.974475,6.86,"--",54.46]
[742,12387450,"Valley Creek near Arlee, Montana",47.170297220000002,-114.23079444,16,"--",16.387]
[743,12388200,"Jocko River at Dixon, Montana",47.312113889999999,-114.29737778000001,383,"--",16.021999999999998]
[744,12388400,"Revais Creek below West Fork, near Dixon, Montana",47.266302779999997,-114.40684444,23.3,"--",8.5670000000000002]
[748,12389500,"Thompson River near Thompson Falls, Montana",47.591858330000001,-115.22953611,638,"--",16]
[749,12390700,"Prospect Creek at Thompson Falls, Montana",47.586061110000003,-115.35509999999999,182,"--",39.091000000000001]
[755,12391550,"Bull River near Noxon, Montana",48.04735556,-115.83500278,141,"--",44.715000000000003]
["Northwest hydrologic region"]
[2,5011000,"Belly River near Mountain View, Alberta",49.099963889999998,-113.69857777999999,123,59.070999999999998,34.622]
[3,5011500,"Waterton River near international boundary",48.954949999999997,-113.89986111,61.8,69.358000000000004,44.585000000000001]
[4,5012500,"Boundary Creek at international boundary",48.995836109999999,-113.90768056,20.399999999999999,68.281999999999996,43.951000000000001]
[6,5013700,"St. Mary River above Swiftcurrent Creek, near Babb, Montana",48.85088056,-113.416175,174,54.131999999999998,33.698]
[9,5014500,"Swiftcurrent Creek at Many Glacier, Montana",48.798833330000001,-113.65673056,31.2,83.156000000000006,53.417000000000002]
[10,5015000,"Canyon Creek near Many Glacier, Montana",48.796047219999998,-113.62418889,7.74,73.914000000000001,65.94]
[14,5020500,"St. Mary River at international boundary",49.011408330000002,-113.29954721999999,462,47.820999999999998,22.574999999999999]
[112,6073000,"Dearborn River near Clemons, Montana",47.294047220000003,-112.44878889,115,30.765999999999998,28.262]
[129,6078500,"North Fork Sun River near Augusta, Montana",47.640827780000002,-112.86021389,259,39.277000000000001,22.129000000000001]
[131,6080000,"Sun River near Augusta, Montana",47.620874999999998,-112.70700278,609,36.613,26.75]
[133,6081500,"Willow Creek near Augusta, Montana",47.545505560000002,-112.47368333,95.1,20.742000000000001,5.6509999999999998]
[134,6084500,"Elk Creek at Augusta, Montana",47.485399999999998,-112.38748611,165,21.933,13.08]
[149,6092000,"Two Medicine River near Browning, Montana",48.471716669999999,-112.80378056000001,320,36.823999999999998,11.497999999999999]
[150,6092500,"Badger Creek near Browning, Montana",48.346219439999999,-112.84086388999999,126,38.470999999999997,25.614999999999998]
[158,6098500,"Cut Bank Creek near Browning, Montana",48.616858329999999,-113.03610833,121,37.268999999999998,14.528]
[178,6102500,"Teton River below South Fork, near Choteau, Montana",47.883083329999998,-112.61198333,110,36.764000000000003,45.442]
[268,6132200,"South Fork Milk River near Babb, Montana",48.753483330000002,-113.16743056,69.099999999999994,34.207999999999998,1.29]
[272,6133500,"North Fork Milk River above St. Mary Canal, near Browning, Montana",48.970783330000003,-113.05596944,60.8,22.962,5.7000000000000002E-2]
[651,12335000,"Blackfoot River near Helmville, Montana",46.93871944,-112.94073611,482,27.236999999999998,15.183999999999999]
[700,12355500,"North Fork Flathead River near Columbia Falls, Montana",48.49579722,-114.12676389000001,1556,43.92,27.783999999999999]
[704,12357000,"Middle Fork Flathead River at Essex, Montana",48.275091670000002,-113.60508889,509,49.219000000000001,35.564999999999998]
[708,12358500,"Middle Fork Flathead River near West Glacier, Montana",48.495516670000001,-114.01020833,1125,49.923999999999999,40.258000000000003]
[711,12359800,"South Fork Flathead River above Twin Creek, near Hungry Horse, Montana",47.97909722,-113.56068333,1159,49.134999999999998,34.841000000000001]
[712,12360000,"Twin Creek near Hungry Horse, Montana",47.98479167,-113.56132778,47.2,47.62,42.408000000000001]
[713,12361000,"Sullivan Creek near Hungry Horse, Montana",48.029538889999998,-113.704125,71.099999999999994,57.68,39.151000000000003]
[714,12361500,"Graves Creek near Hungry Horse, Montana",48.12785556,-113.81207222,27.9,65.552999999999997,42.243000000000002]
["Upper Yellowstone-Central Mountain hydrologic region"]
[77,6043000,"Taylor Creek near Grayling, Montana",45.070897219999999,-111.20516944000001,98,33.606999999999999,"--"]
[80,6043500,"Gallatin River near Gallatin Gateway, Montana",45.497300000000003,-111.27070833000001,819,34.656999999999996,"--"]
[84,6048000,"East Gallatin River at Bozeman, Montana",45.700536110000002,-111.02926667,151,26.616,"--"]
[85,6048500,"Bridger Creek near Bozeman, Montana",45.705174999999997,-110.96205556,62.3,32.927,"--"]
[87,6050000,"Hyalite Creek at Hyalite Ranger Station, near Bozeman, Montana",45.561466670000001,-111.07112499999999,48.5,33.843000000000004,"--"]
[88,6052500,"Gallatin River at Logan, Montana",45.885355560000001,-111.43828611000001,1789,27.818999999999999,"--"]
[122,6077000,"Sheep Creek near White Sulphur Springs, Montana",46.768163889999997,-110.80997778,43.1,27.927,"--"]
[125,6077500,"Smith River near Eden, Montana",47.190052780000002,-111.38719444,1588,19.613,"--"]
[143,6090500,"Belt Creek near Monarch, Montana",47.208594439999999,-110.93174722000001,355,24.952999999999999,"--"]
[190,6109800,"South Fork Judith River near Utica, Montana",46.75343333,-110.32315833,49.9,26.42,"--"]
[192,6110000,"Judith River near Utica, Montana",46.892411109999998,-110.23145278,312,25.036000000000001,"--"]
[193,6111000,"Ross Fork Creek near Hobson, Montana",46.992736110000003,-109.795075,340,16.812000000000001,"--"]
[197,6114500,"Wolf Creek near Stanford, Montana",47.11900833,-110.28720278,116.08,22.606000000000002,"--"]
[205,6115500,"North Fork Musselshell River near Delpine, Montana",46.609786110000002,-110.57662222,37.299999999999997,23.224,"--"]
[209,6118500,"South Fork Musselshell River above Martinsdale, Montana",46.453241669999997,-110.38228889,268,24.091000000000001,"--"]
[212,6120500,"Musselshell River at Harlowton, Montana",46.428800000000003,-109.84119444,1108,20.611999999999998,"--"]
[217,6121000,"American Fork near Harlowton, Montana",46.373952780000003,-109.79209167,79.099999999999994,21.36,"--"]
[218,6121500,"Lebo Creek near Harlowton, Montana",46.380419439999997,-109.79929444,54.6,16.454000000000001,"--"]
[219,6122000,"American Fork below Lebo Creek, near Harlowton, Montana",46.396197219999998,-109.74214444,171,20.802,"--"]
[423,6191000,"Gardner River near Mammoth, Yellowstone National Park, Wyoming",44.992344439999997,-110.69097499999999,198,32.328000000000003,"--"]
[424,6191500,"Yellowstone River at Corwin Springs, Montana",45.112119440000001,-110.79366666999999,2616,31.33,"--"]
[426,6193000,"Shields River near Wilsall, Montana",46.152605559999998,-110.58681944,90.9,30.835000000000001,"--"]
[427,6193500,"Shields River at Clyde Park, Montana",45.885733330000001,-110.61795832999999,539,22.997,"--"]
[428,6194000,"Brackett Creek near Clyde Park, Montana",45.866619440000001,-110.67023055999999,58.1,29.831,"--"]
[430,6197000,"Big Timber Creek near Big Timber, Montana",45.954311109999999,-110.02945556,75.3,26.763999999999999,"--"]
[431,6197500,"Boulder River near Contact, Montana",45.554533329999998,-110.20054167000001,225,35.338000000000001,"--"]
[432,6200000,"Boulder River at Big Timber, Montana",45.833794439999998,-109.93870556,525,30.524000000000001,"--"]
[433,6200500,"Sweet Grass Creek above Melville, Montana",46.155380559999998,-110.08705,60.4,35.975000000000001,"--"]
[434,6201000,"Sweet Grass Creek below Melville, Montana",46.06143333,-109.84524166999999,147,25.823,"--"]
[440,6202510,"Stillwater River above Nye Creek, near Nye, Montana",45.394308330000001,-109.86951667,192,38.847000000000001,"--"]
[442,6204500,"Rosebud Creek near Absarokee, Montana",45.486591670000003,-109.45613056000001,396,31.599,"--"]
[443,6205000,"Stillwater River near Absarokee, Montana",45.551436109999997,-109.38803056,976,30.164999999999999,"--"]
[445,6207500,"Clarks Fork Yellowstone River near Belfry, Montana",45.009911109999997,-109.06536667,1152,27.913,"--"]
[447,6207800,"Bluewater Creek near Bridger, Montana",45.331372219999999,-108.801475,28.1,21.013999999999999,"--"]
[450,6209500,"Rock Creek near Red Lodge, Montana",45.086147220000001,-109.32918889,105,33.573999999999998,"--"]
[451,6210000,"West Fork Rock Creek below Basin Creek, near Red Lodge, Montana",45.154536110000002,-109.36743333,51.1,32.933,"--"]
[453,6211000,"Red Lodge Creek above Cooney Reservoir, near Boyd, Montana",45.437849999999997,-109.25331111,142,23.78,"--"]
[454,6211500,"Willow Creek near Boyd, Montana",45.422147219999999,-109.23053056000001,49.2,20.878,"--"]
[460,6216000,"Pryor Creek at Pryor, Montana",45.434677780000001,-108.53365278,118,20.271000000000001,"--"]
[464,6216900,"Pryor Creek near Huntley, Montana",45.819694439999999,-108.29033333,574,17.827000000000002,"--"]
[471,6287500,"Soap Creek near St. Xavier, Montana",45.326908330000002,-107.76982778,94.4,19.937000000000001,"--"]
[472,6288000,"Rotten Grass Creek near St. Xavier, Montana",45.412166669999998,-107.68310278,146,18.914000000000001,"--"]
[473,6288200,"Beauvais Creek near St. Xavier, Montana",45.477038890000003,-108.00796389,123,19.016999999999999,"--"]
[475,6289000,"Little Bighorn River at State line, near Wyola, Montana",45.007111109999997,-107.61540832999999,182,26.693999999999999,"--"]
[477,6290000,"Pass Creek near Wyola, Montana",45.056263889999997,-107.35590000000001,113,20.068000000000001,"--"]
[479,6290500,"Little Bighorn River below Pass Creek, near Wyola, Montana",45.177133329999997,-107.39455,426,22.353999999999999,"--"]
[480,6291000,"Owl Creek near Lodge Grass, Montana",45.26796667,-107.30138332999999,163,18.738,"--"]
[481,6291500,"Lodge Grass Creek above Willow Creek diversion, near Wyola, Montana",45.126480559999997,-107.59989167000001,83.9,23.187000000000001,"--"]
[484,6294000,"Little Bighorn River near Hardin, Montana",45.735686110000003,-107.55746944000001,1294,19.597999999999999,"--"]
["Southwest hydrologic region"]
[15,6006000,"Red Rock Creek above Lakes, near Lakeview, Montana",44.617030560000003,-111.65674722,37.299999999999997,37.018000000000001,10.268000000000001]
[16,6011000,"Red Rock River at Kennedy Ranch, near Lakeview, Montana",44.647930559999999,-112.05640556,321,27.318999999999999,4.4000000000000004]
[20,6013500,"Big Sheep Creek below Muddy Creek, near Dell, Montana",44.65511111,-112.778475,279,19.765999999999998,10.601000000000001]
[25,6015500,"Grasshopper Creek near Dillon, Montana",45.110141669999997,-112.80081944,348,16.738,3.956]
[29,6017500,"Blacktail Deer Creek near Dillon, Montana",45.046063889999999,-112.54965556000001,316,20.411000000000001,6.3819999999999997]
[33,6019500,"Ruby River above reservoir, near Alder, Montana",45.192319439999999,-112.14281667,534,21.619,6.1349999999999998]
[39,6024450,"Big Hole River below Big Lake Creek, at Wisdom, Montana",45.617966670000001,-113.45694167000001,586,23.271999999999998,5.0069999999999997]
[40,6024500,"Trail Creek near Wisdom, Montana",45.656419440000001,-113.71670278000001,72.599999999999994,36.442999999999998,0.96199999999999997]
[41,6024540,"Big Hole River below Mudd Creek, near Wisdom, Montana",45.807541669999999,-113.31326944,1275,23.652999999999999,3.8180000000000001]
[42,6024590,"Wise River near Wise River, Montana",45.704555560000003,-113.03161111,221,27.881,14.769]
[45,6025500,"Big Hole River near Melrose, Montana",45.526580559999999,-112.701725,2472,23.553000000000001,6.984]
[46,6026000,"Birch Creek near Glen, Montana",45.37949167,-112.79754444,35.700000000000003,24.382000000000001,18.841999999999999]
[54,6030500,"Boulder River above Rock Creek, near Basin, Montana",46.254269440000002,-112.50094722,24.4,24.254000000000001,0.995]
[56,6033000,"Boulder River near Boulder, Montana",46.211030559999998,-112.09165,381,22.003,5.3179999999999996]
[60,6035000,"Willow Creek near Harrison, Montana",45.723058330000001,-111.74102499999999,85.9,27.940999999999999,16.713999999999999]
[62,6036500,"Willow Creek near Willow Creek, Montana",45.750349999999997,-111.65820832999999,167,22.306000000000001,9.0739999999999998]
[74,6040300,"Jack Creek near Ennis, Montana",45.356266669999997,-111.58162222,51.3,30.565000000000001,22.553000000000001]
[91,6055500,"Crow Creek near Radersburg, Montana",46.262288890000001,-111.68711944,77.900000000000006,25.632000000000001,6.5549999999999997]
[97,6061500,"Prickly Pear Creek near Clancy, Montana",46.519097219999999,-111.94678611000001,192,19.059000000000001,4.9050000000000002]
[101,6062500,"Tenmile Creek near Rimini, Montana",46.523897220000002,-112.25664722,33,24.777999999999999,7.5380000000000003]
[103,6063000,"Tenmile Creek near Helena, Montana",46.604925000000001,-112.08936111,98.7,20.861000000000001,5.6349999999999998]
[106,6068500,"Little Prickly Pear Creek near Marysville, Montana",46.787711109999996,-112.40672222000001,44.6,23.792000000000002,19.780999999999999]
[107,6071000,"Little Prickly Pear Creek near Canyon Creek, Montana",46.818908329999999,-112.25050555999999,182,20.943999999999999,12.387]
[109,6071300,"Little Prickly Pear Creek at Wolf Creek, Montana",47.005436109999998,-112.07031111000001,391,18.468,13.943]

{"sheet":"Table 1-3_Lookup","index":3,"n_rows":225,"n_cols":34,"rows_kept":225,"cut":false,"hidden":true,"merged":[[168,0,168,10],[223,0,223,10],[224,0,224,10],[0,0,0,9],[3,0,3,10],[1,0,1,10],[58,0,58,10],[113,0,113,10]]}
["Table 1-4.  Regression equations for estimating streamflow characteristics at ungaged sites in Western Montana."]
["[Q, streamflow, in cubic feet per second, for indicated streamflow characteristic (definitions provided in table 1-XX); A, contributing drainage area, in square miles; SLP50, percent of basin with slope greater than 50 percent; P, mean annual precipitation, in inches; GLS, generalized least squares; OLS, ordinary least squares; n, number of gaging stations used in developing regression equations for indicated hydrologic region; MEV, model error variance;  --, not determined for method of regression used; AVP, average variance of prediction;SEM, average standard error of model; SEP, average standard error of prediction; Pseudo-R2, pseudo coefficient of determination; RMSE, root mean square error of model; R2, coefficient of detemination] "]
["Regression equation for indicated streamflow characteristic","Method of regression","Number of gaging stations (n)1","MEV, in log units","AVP, in log units","SEM, \nin percent","SEP, \nin percent","Pseudo-R2, \nin percent","RMSE, \nin percent","R2, \nin percent","Coefficient for drainage area adjustment2",null,null,null,null,null,null,null,null,null,"=sign","A","P","SLP50",null,null,null,"Region","Flow","V1","V2","Contant exp","V1 exp","V2 exp"]
["West hydrologic region"]
["QAL7Q10=10-1.678A0.964(SLP50 + 1)0.676","GLS",43,6.7000000000000004E-2,7.2999999999999995E-2,65.430000000000007,68.540000000000006,84.85,"--","--",0.82264394829699328,null,null,null,null,null,1,null,null,null,{"$f":"FIND(\"=\",A5)","v":8},{"$f":"FIND(V$3,$A5,U5)","v":17},{"$f":"IF(X5<>\"X\",\"X\",FIND(W$3,$A5))","v":"X"},{"$f":"IF(ISERROR(FIND(X$3,$A5)),\"X\",FIND(X$3,$A5))","v":24},null,{"$f":"IF(W5=\"X\",FIND(\"(\",A5),W5)","v":23},{"$f":"IF(W5=\"X\",FIND(\")\",A5),W5)","v":33},"West","QAL7Q10","A",{"$f":"IF(W5=\"X\",\"SLP50\",\"P\")","v":"SLP50"},{"$f":"MID(A5,U5+3,V5-U5-3)","v":"-1.678"},{"$f":"MID(A5,V5+1,Z5-V5-1)","v":"0.964"},{"$f":"MID(A5,AA5+1,LEN(A5)-AA5)","v":"0.676"}]
["QS214Q5=10-1.402A0.913(SLP50 + 1)0.711","GLS",46,7.1999999999999995E-2,7.8E-2,68.430000000000007,71.44,82.92,"--","--",0.77473055852160466,null,null,null,null,null,2,null,null,null,{"$f":"FIND(\"=\",A6)","v":8},{"$f":"FIND(V$3,$A6,U6)","v":17},{"$f":"IF(X6<>\"X\",\"X\",FIND(W$3,$A6))","v":"X"},{"$f":"IF(ISERROR(FIND(X$3,$A6)),\"X\",FIND(X$3,$A6))","v":24},null,{"$f":"IF(W6=\"X\",FIND(\"(\",A6),W6)","v":23},{"$f":"IF(W6=\"X\",FIND(\")\",A6),W6)","v":33},"West","QS214Q5","A",{"$f":"IF(W6=\"X\",\"SLP50\",\"P\")","v":"SLP50"},{"$f":"MID(A6,U6+3,V6-U6-3)","v":"-1.402"},{"$f":"MID(A6,V6+1,Z6-V6-1)","v":"0.913"},{"$f":"MID(A6,AA6+1,LEN(A6)-AA6)","v":"0.711"}]
["QA0.2=10-0.913A0.956(SLP50 + 1)0.882","OLS",50,"--","--","--","--","--",53.196701474335384,88.51,0.78628827750882424,null,null,null,null,null,3,null,null,null,6,15,"X",22,null,21,31,"West","QA0.2","A","SLP50","-0.913","0.956","0.882"]
["QA0.5=10-1.075A0.937(SLP50 + 1)0.716","OLS",50,"--","--","--","--","--",41.521936364144445,92.11,0.79939535767183023,null,null,null,null,null,4,null,null,null,6,15,"X",22,null,21,31,"West","QA0.5","A","SLP50","-1.075","0.937","0.716"]
["QA0.8=10-1.405A0.942(SLP50 + 1)0.732","OLS",50,"--","--","--","--","--",45.858813208494141,90.77,0.80054195022499708,null,null,null,null,null,5,null,null,null,6,15,"X",22,null,21,31,"West","QA0.8","A","SLP50","-1.405","0.942","0.732"]
["QAMEAN=10-0.973A0.95(SLP50 + 1)0.827","OLS",50,"--","--","--","--","--",45.155627502771047,91.13,0.78998391349710251,null,null,null,null,null,6,null,null,null,7,16,"X",22,null,21,31,"West","QAMEAN","A","SLP50","-0.973","0.95","0.827"]
["QJAN0.2=10-1.355A1.005(SLP50 + 1)0.763","OLS",51,"--","--","--","--","--",47.927857432976431,91.05,0.85898139504362925,null,null,null,null,null,7,null,null,null,8,17,"X",24,null,23,33,"West","QJAN0.2","A","SLP50","-1.355","1.005","0.763"]
["QJAN0.5=10-1.539A1.00(SLP50 + 1)0.792","OLS",51,"--","--","--","--","--",49.94236163139955,90.29,0.84883079288166385,null,null,null,null,null,8,null,null,null,8,17,"X",23,null,22,32,"West","QJAN0.5","A","SLP50","-1.539","1.00","0.792"]
["QJAN0.8=10-1.832A1.011(SLP50 + 1)0.88","OLS",51,"--","--","--","--","--",64.727733027560731,85.88,0.84268426113567185,null,null,null,null,null,9,null,null,null,8,17,"X",24,null,23,33,"West","QJAN0.8","A","SLP50","-1.832","1.011","0.88"]
["QJANMEAN=10-1.384A0.996(SLP50 + 1)0.725","OLS",51,"--","--","--","--","--",47.927857432976431,90.86,0.85683297794902247,null,null,null,null,null,10,null,null,null,9,18,"X",25,null,24,34,"West","QJANMEAN","A","SLP50","-1.384","0.996","0.725"]
["QFEB0.2=10-1.221A1.007(SLP50 + 1)0.662","OLS",52,"--","--","--","--","--",47.244611829214058,91.1,0.8761907286664038,null,null,null,null,null,11,null,null,null,8,17,"X",24,null,23,33,"West","QFEB0.2","A","SLP50","-1.221","1.007","0.662"]
["QFEB0.5=10-1.513A1.019(SLP50 + 1)0.74","OLS",52,"--","--","--","--","--",50.602958909477245,90.18,0.87268807300759788,null,null,null,null,null,12,null,null,null,8,17,"X",24,null,23,33,"West","QFEB0.5","A","SLP50","-1.513","1.019","0.74"]
["QFEB0.8=10-1.938A1.037(SLP50 + 1)0.914","OLS",52,"--","--","--","--","--",77.652885543736389,82.29,0.85641545934237129,null,null,null,null,null,13,null,null,null,8,17,"X",24,null,23,33,"West","QFEB0.8","A","SLP50","-1.938","1.037","0.914"]
["QFEBMEAN=10-1.356A1.015(SLP50 + 1)0.683","OLS",52,"--","--","--","--","--",50.602958909477245,90.23,0.88003340770378635,null,null,null,null,null,14,null,null,null,9,18,"X",25,null,24,34,"West","QFEBMEAN","A","SLP50","-1.356","1.015","0.683"]
["QMAR0.2=10-0.944A1.014(SLP50 + 1)0.52","OLS",52,"--","--","--","--","--",58.795779438743267,87.72,0.91199575217762652,null,null,null,null,null,15,null,null,null,8,17,"X",24,null,23,33,"West","QMAR0.2","A","SLP50","-0.944","1.014","0.52"]
["QMAR0.5=10-1.235A1.019(SLP50 + 1)0.604","OLS",52,"--","--","--","--","--",47.927857432976431,91.08,0.90024346736141492,null,null,null,null,null,16,null,null,null,8,17,"X",24,null,23,33,"West","QMAR0.5","A","SLP50","-1.235","1.019","0.604"]
["QMAR0.8=10-1.57A1.032(SLP50 + 1)0.716","OLS",52,"--","--","--","--","--",50.602958909477245,90.54,0.89052285190212499,null,null,null,null,null,17,null,null,null,8,16,"X",23,null,22,32,"West","QMAR0.8","A","SLP50","-1.57","1.032","0.716"]
["QMARMEAN=10-1.045A1.014(SLP50 + 1)0.529","OLS",52,"--","--","--","--","--",52.555165433651716,89.62,0.90971201451774641,null,null,null,null,null,18,null,null,null,9,18,"X",25,null,24,34,"West","QMARMEAN","A","SLP50","-1.045","1.014","0.529"]
["QAPR0.2=10-0.524A0.997(SLP50 + 1)0.574","OLS",53,"--","--","--","--","--",79.290480603181123,81.13,0.88871472896694992,null,null,null,null,null,19,null,null,null,8,17,"X",24,null,23,33,"West","QAPR0.2","A","SLP50","-0.524","0.997","0.574"]
["QAPR0.5=10-0.954A1.027(SLP50 + 1)0.649","OLS",53,"--","--","--","--","--",71.006008672913083,84.33,0.90397308665703224,null,null,null,null,null,20,null,null,null,8,17,"X",24,null,23,33,"West","QAPR0.5","A","SLP50","-0.954","1.027","0.649"]
["QAPR0.8=10-1.164A1.021(SLP50 + 1)0.633","OLS",53,"--","--","--","--","--",60.003328820844445,87.6,0.90189914436237162,null,null,null,null,null,21,null,null,null,8,17,"X",24,null,23,33,"West","QAPR0.8","A","SLP50","-1.164","1.021","0.633"]
["QAPRMEAN=10-0.714A0.998(SLP50 + 1)0.601","OLS",53,"--","--","--","--","--",72.126311117702997,83.28,0.8848974282060047,null,null,null,null,null,22,null,null,null,9,18,"X",25,null,24,34,"West","QAPRMEAN","A","SLP50","-0.714","0.998","0.601"]
["QMAY0.2=10-0.387A0.961(SLP50 + 1)0.819","OLS",53,"--","--","--","--","--",65.885859146084741,84.32,0.80635262508315164,null,null,null,null,null,23,null,null,null,8,17,"X",24,null,23,33,"West","QMAY0.2","A","SLP50","-0.387","0.961","0.819"]
["QMAY0.5=10-0.769A0.995(SLP50 + 1)0.886","OLS",53,"--","--","--","--","--",70.443686077063731,83.72,0.82790983831650489,null,null,null,null,null,24,null,null,null,8,17,"X",24,null,23,33,"West","QMAY0.5","A","SLP50","-0.769","0.995","0.886"]
["QMAY0.8=10-1.049A1.011(SLP50 + 1)0.899","OLS",53,"--","--","--","--","--",77.105156586344776,82.18,0.84090751771551375,null,null,null,null,null,25,null,null,null,8,17,"X",24,null,23,33,"West","QMAY0.8","A","SLP50","-1.049","1.011","0.899"]
["QMAYMEAN=10-0.567A0.971(SLP50 + 1)0.823","OLS",53,"--","--","--","--","--",66.461895711315023,84.38,0.81572064598145599,null,null,null,null,null,26,null,null,null,9,18,"X",25,null,24,34,"West","QMAYMEAN","A","SLP50","-0.567","0.971","0.823"]
["QJUN0.2=10-0.559A0.955(SLP50 + 1)0.967","OLS",53,"--","--","--","--","--",54.467056216302211,88.21,0.77228030760280342,null,null,null,null,null,27,null,null,null,8,17,"X",24,null,23,33,"West","QJUN0.2","A","SLP50","-0.559","0.955","0.967"]
["QJUN0.5=10-0.987A0.975(SLP50 + 1)1.107","OLS",53,"--","--","--","--","--",60.003328820844445,87,0.76560918517266285,null,null,null,null,null,28,null,null,null,8,17,"X",24,null,23,33,"West","QJUN0.5","A","SLP50","-0.987","0.975","1.107"]
["QJUN0.8=10-1.27A0.958(SLP50 + 1)1.167","OLS",53,"--","--","--","--","--",65.885859146084741,84.99,0.73775334503020162,null,null,null,null,null,29,null,null,null,8,16,"X",23,null,22,32,"West","QJUN0.8","A","SLP50","-1.27","0.958","1.167"]
["QJUNMEAN=10-0.776A0.956(SLP50 + 1)1.017","OLS",53,"--","--","--","--","--",55.096203033983784,88.12,0.76375539656915459,null,null,null,null,null,30,null,null,null,9,18,"X",25,null,24,34,"West","QJUNMEAN","A","SLP50","-0.776","0.956","1.017"]
["QJUL0.2=10-0.986A0.923(SLP50 + 1)1.021","OLS",53,"--","--","--","--","--",58.795779438743267,86.18,0.73040929996381587,null,null,null,null,null,31,null,null,null,8,17,"X",24,null,23,33,"West","QJUL0.2","A","SLP50","-0.986","0.923","1.021"]
["QJUL0.5=10-1.154A0.897(SLP50 + 1)1.019","OLS",53,"--","--","--","--","--",60.602803839314724,84.85,0.70463663447006641,null,null,null,null,null,32,null,null,null,8,17,"X",24,null,23,33,"West","QJUL0.5","A","SLP50","-1.154","0.897","1.019"]
["QJUL0.8=10-1.312A0.878(SLP50 + 1)1.006","OLS",53,"--","--","--","--","--",63.561056954656124,83.12,0.68815821355589857,null,null,null,null,null,33,null,null,null,8,17,"X",24,null,23,33,"West","QJUL0.8","A","SLP50","-1.312","0.878","1.006"]
["QJULMEAN=10-1.077A0.908(SLP50 + 1)1.009","OLS",53,"--","--","--","--","--",55.721534500516022,86.73,0.71701399525610066,null,null,null,null,null,34,null,null,null,9,18,"X",25,null,24,34,"West","QJULMEAN","A","SLP50","-1.077","0.908","1.009"]
["QAUG0.2=10-1.025A0.886(SLP50 + 1)0.807","OLS",53,"--","--","--","--","--",58.187491963191974,84.97,0.73369722513829472,null,null,null,null,null,35,null,null,null,8,17,"X",24,null,23,33,"West","QAUG0.2","A","SLP50","-1.025","0.886","0.807"]
["QAUG0.5=10-1.224A0.88(SLP50 + 1)0.857","OLS",53,"--","--","--","--","--",62.385216362602037,83.18,0.71804703436605888,null,null,null,null,null,36,null,null,null,8,17,"X",23,null,22,32,"West","QAUG0.5","A","SLP50","-1.224","0.88","0.857"]
["QAUG0.8=10-1.563A0.891(SLP50 + 1)0.971","OLS",53,"--","--","--","--","--",76.556436342648624,78.760000000000005,0.70721970359429465,null,null,null,null,null,37,null,null,null,8,17,"X",24,null,23,33,"West","QAUG0.8","A","SLP50","-1.563","0.891","0.971"]
["QAUGMEAN=10-1.16A0.881(SLP50 + 1)0.831","OLS",53,"--","--","--","--","--",60.003328820844445,84.28,0.72420123571895234,null,null,null,null,null,38,null,null,null,9,17,"X",24,null,23,33,"West","QAUGMEAN","A","SLP50","-1.16","0.881","0.831"]
["QSEP0.2=10-1.174A0.923(SLP50 + 1)0.776","OLS",53,"--","--","--","--","--",51.909156538819033,88.11,0.7760151952237625,null,null,null,null,null,39,null,null,null,8,17,"X",24,null,23,33,"West","QSEP0.2","A","SLP50","-1.174","0.923","0.776"]
["QSEP0.5=10-1.358A0.93(SLP50 + 1)0.8","OLS",53,"--","--","--","--","--",61.79365388156458,84.89,0.77931258167834894,null,null,null,null,null,40,null,null,null,8,17,"X",23,null,22,32,"West","QSEP0.5","A","SLP50","-1.358","0.93","0.8"]
["QSEP0.8=10-1.708A0.95(SLP50 + 1)0.921","OLS",53,"--","--","--","--","--",90.582565993008515,76.17,0.77563199442972663,null,null,null,null,null,41,null,null,null,8,17,"X",23,null,22,32,"West","QSEP0.8","A","SLP50","-1.708","0.95","0.921"]
["QSEPMEAN=10-1.319A0.923(SLP50 + 1)0.813","OLS",53,"--","--","--","--","--",55.096203033983784,87.13,0.76902786828532133,null,null,null,null,null,42,null,null,null,9,18,"X",25,null,24,34,"West","QSEPMEAN","A","SLP50","-1.319","0.923","0.813"]
["QOCT0.2=10-1.232A0.92(SLP50 + 1)0.843","OLS",52,"--","--","--","--","--",46.555032272692976,90.17,0.75954115946724543,null,null,null,null,null,43,null,null,null,8,17,"X",23,null,22,32,"West","QOCT0.2","A","SLP50","-1.232","0.92","0.843"]
["QOCT0.5=10-1.403A0.947(SLP50 + 1)0.824","OLS",52,"--","--","--","--","--",48.60505499970774,89.97,0.79002806463471287,null,null,null,null,null,44,null,null,null,8,17,"X",24,null,23,33,"West","QOCT0.5","A","SLP50","-1.403","0.947","0.824"]
["QOCT0.8=10-1.678A0.979(SLP50 + 1)0.872","OLS",52,"--","--","--","--","--",73.241147225708787,82.54,0.81307445939314316,null,null,null,null,null,45,null,null,null,8,17,"X",24,null,23,33,"West","QOCT0.8","A","SLP50","-1.678","0.979","0.872"]
["QOCTMEAN=10-1.389A0.943(SLP50 + 1)0.857","OLS",52,"--","--","--","--","--",45.858813208494141,90.92,0.77918122497840547,null,null,null,null,null,46,null,null,null,9,18,"X",25,null,24,34,"West","QOCTMEAN","A","SLP50","-1.389","0.943","0.857"]
["QNOV0.2=10-1.314A0.965(SLP50 + 1)0.857","OLS",52,"--","--","--","--","--",48.60505499970774,89.88,0.79561602566080469,null,null,null,null,null,47,null,null,null,8,17,"X",24,null,23,33,"West","QNOV0.2","A","SLP50","-1.314","0.965","0.857"]
["QNOV0.5=10-1.438A0.972(SLP50 + 1)0.818","OLS",52,"--","--","--","--","--",45.858813208494141,90.96,0.81036596787255089,null,null,null,null,null,48,null,null,null,8,17,"X",24,null,23,33,"West","QNOV0.5","A","SLP50","-1.438","0.972","0.818"]
["QNOV0.8=10-1.622A0.983(SLP50 + 1)0.824","OLS",52,"--","--","--","--","--",60.602803839314724,86.25,0.82019830296110563,null,null,null,null,null,49,null,null,null,8,17,"X",24,null,23,33,"West","QNOV0.8","A","SLP50","-1.622","0.983","0.824"]
["QNOVMEAN=10-1.37A0.962(SLP50 + 1)0.83","OLS",52,"--","--","--","--","--",49.276472527795462,89.73,0.79785572735165511,null,null,null,null,null,50,null,null,null,9,17,"X",24,null,23,33,"West","QNOVMEAN","A","SLP50","-1.37","0.962","0.83"]
["QDEC0.2=10-1.342A0.972(SLP50 + 1)0.837","OLS",52,"--","--","--","--","--",50.602958909477245,89.34,0.80713755633155493,null,null,null,null,null,51,null,null,null,8,17,"X",24,null,23,33,"West","QDEC0.2","A","SLP50","-1.342","0.972","0.837"]
["QDEC0.5=10-1.523A0.976(SLP50 + 1)0.841","OLS",52,"--","--","--","--","--",50.602958909477245,89.54,0.80980753370769931,null,null,null,null,null,52,null,null,null,8,17,"X",24,null,23,33,"West","QDEC0.5","A","SLP50","-1.523","0.976","0.841"]
["QDEC0.8=10-1.805A1.001(SLP50 + 1)0.894","OLS",52,"--","--","--","--","--",71.006008672913083,83.34,0.82431149117590652,null,null,null,null,null,53,null,null,null,8,17,"X",24,null,23,33,"West","QDEC0.8","A","SLP50","-1.805","1.001","0.894"]
["QDECMEAN=10-1.41A0.971(SLP50 + 1)0.816","OLS",52,"--","--","--","--","--",53.196701474335384,88.47,0.8104159081780048,null,null,null,null,null,54,null,null,null,9,17,"X",24,null,23,33,"West","QDECMEAN","A","SLP50","-1.41","0.971","0.816"]
["Northwest hydrologic region"]
["QAL7Q10=10-3.28A1.046(SLP50 + 1)1.587","GLS",14,7.1999999999999995E-2,0.09,67.92,78.12,85.57,"--","--",1.0840747697837747,null,null,null,null,null,1,null,null,null,{"$f":"FIND(\"=\",A60)","v":8},16,"X",23,null,22,32,"Northwest","QAL7Q10","A",{"$f":"IF(W60=\"X\",\"SLP50\",\"P\")","v":"SLP50"},"-3.28","1.046",{"$f":"MID(A60,AA60+1,LEN(A60)-AA60)","v":"1.587"}]
["QS214Q5=10-4.375A1.088P2.212","GLS",24,0.104,0.11799999999999999,85.6,93.18,78.989999999999995,"--","--",0.92095547306449543,null,null,null,null,null,2,null,null,null,{"$f":"FIND(\"=\",A61)","v":8},17,23,"X",null,23,23,"Northwest","QS214Q5","A","P","-4.375","1.088","2.212"]
["QA0.2=10-2.844A1.017P1.984","OLS",18,"--","--","--","--","--",30.711609287771889,95.32,0.8179146378344343,null,null,null,null,null,3,null,null,null,6,15,21,"X",null,21,21,"Northwest","QA0.2","A","P","-2.844","1.017","1.984"]
["QA0.5=10-2.421A1.056P1.451","OLS",18,"--","--","--","--","--",50.602958909477245,89.25,0.91098857325756999,null,null,null,null,null,4,null,null,null,6,15,21,"X",null,21,21,"Northwest","QA0.5","A","P","-2.421","1.056","1.451"]
["QA0.8=10-2.839A1.074P1.466","OLS",18,"--","--","--","--","--",47.244611829214058,90.79,0.92678887055903758,null,null,null,null,null,5,null,null,null,6,15,21,"X",null,21,21,"Northwest","QA0.8","A","P","-2.839","1.074","1.466"]
["QAMEAN=10-2.763A0.993P1.845","OLS",18,"--","--","--","--","--",17.978655225868973,98.13,0.80822550898463885,null,null,null,null,null,6,null,null,null,7,16,22,"X",null,22,22,"Northwest","QAMEAN","A","P","-2.763","0.993","1.845"]
["QJAN0.2=10-2.565A0.97P1.446","OLS",18,"--","--","--","--","--",30.711609287771889,94.6,0.82560411580611459,null,null,null,null,null,7,null,null,null,8,17,22,"X",null,22,22,"Northwest","QJAN0.2","A","P","-2.565","0.97","1.446"]
["QJAN0.5=10-2.689A0.992P1.383","OLS",18,"--","--","--","--","--",33.446316852914677,94.04,0.85340717435425373,null,null,null,null,null,8,null,null,null,8,17,23,"X",null,23,23,"Northwest","QJAN0.5","A","P","-2.689","0.992","1.383"]
["QJAN0.8=10-2.705A0.981P1.304","OLS",18,"--","--","--","--","--",39.230913082500145,91.99,0.85000379932052994,null,null,null,null,null,9,null,null,null,8,17,23,"X",null,23,23,"Northwest","QJAN0.8","A","P","-2.705","0.981","1.304"]
["QJANMEAN=10-2.681A0.986P1.428","OLS",18,"--","--","--","--","--",29.754596059843468,95.23,0.84273104340086147,null,null,null,null,null,10,null,null,null,9,18,24,"X",null,24,24,"Northwest","QJANMEAN","A","P","-2.681","0.986","1.428"]
["QFEB0.2=10-2.005A0.968P1.106","OLS",19,"--","--","--","--","--",28.771079665258963,95.14,0.85328231718445502,null,null,null,null,null,11,null,null,null,8,{"$f":"FIND(V$3,$A70,U70)","v":17},{"$f":"IF(X70<>\"X\",\"X\",FIND(W$3,$A70))","v":23},{"$f":"IF(ISERROR(FIND(X$3,$A70)),\"X\",FIND(X$3,$A70))","v":"X"},null,{"$f":"IF(W70=\"X\",FIND(\"(\",A70),W70)","v":23},{"$f":"IF(W70=\"X\",FIND(\")\",A70),W70)","v":23},"Northwest","QFEB0.2","A","P",{"$f":"MID(A70,U70+3,V70-U70-3)","v":"-2.005"},{"$f":"MID(A70,V70+1,Z70-V70-1)","v":"0.968"},"1.106"]
["QFEB0.5=10-1.982A0.97P0.99","OLS",19,"--","--","--","--","--",30.711609287771889,94.56,0.86718230575559163,null,null,null,null,null,12,null,null,null,8,17,22,"X",null,22,22,"Northwest","QFEB0.5","A","P","-1.982","0.97","0.99"]
["QFEB0.8=10-2.318A0.994P1.053","OLS",19,"--","--","--","--","--",36.012807865166288,93.14,0.88507311248866904,null,null,null,null,null,13,null,null,null,8,17,23,"X",null,23,23,"Northwest","QFEB0.8","A","P","-2.318","0.994","1.053"]
["QFEBMEAN=10-2.1A0.968P1.111","OLS",19,"--","--","--","--","--",29.754596059843468,94.76,0.8532355058499953,null,null,null,null,null,14,null,null,null,9,16,22,"X",null,22,22,"Northwest","QFEBMEAN","A","P","-2.1","0.968","1.111"]
["QMAR0.2=10-1.784A0.993P0.974","OLS",21,"--","--","--","--","--",34.318557809831169,93.85,0.92180287158358687,null,null,null,null,null,15,null,null,null,8,17,23,"X",null,23,23,"Northwest","QMAR0.2","A","P","-1.784","0.993","0.974"]
["QMAR0.5=10-1.944A0.981P0.975","OLS",21,"--","--","--","--","--",32.55551209131373,94.31,0.90983622575354417,null,null,null,null,null,16,null,null,null,8,17,23,"X",null,23,23,"Northwest","QMAR0.5","A","P","-1.944","0.981","0.975"]
["QMAR0.8=10-2.579A1.038P1.162","OLS",21,"--","--","--","--","--",43.000627371013515,91.76,0.95311047461946297,null,null,null,null,null,17,null,null,null,8,17,23,"X",null,23,23,"Northwest","QMAR0.8","A","P","-2.579","1.038","1.162"]
["QMARMEAN=10-1.863A0.991P0.966","OLS",21,"--","--","--","--","--",34.318557809831169,93.9,0.92016125835888907,null,null,null,null,null,18,null,null,null,9,18,24,"X",null,24,24,"Northwest","QMARMEAN","A","P","-1.863","0.991","0.966"]
["QAPR0.2=10-2.777A1.077P1.798","OLS",25,"--","--","--","--","--",43.000627371013515,91.74,0.9591601218383401,null,null,null,null,null,19,null,null,null,8,17,{"$f":"IF(X78<>\"X\",\"X\",FIND(W$3,$A78,U78))","v":23},"X",null,23,23,"Northwest","QAPR0.2","A","P","-2.777","1.077","1.798"]
["QAPR0.5=10-2.699A1.073P1.564","OLS",25,"--","--","--","--","--",44.445124250513942,90.9,0.97094200079266268,null,null,null,null,null,20,null,null,null,8,17,{"$f":"IF(X79<>\"X\",\"X\",FIND(W$3,$A79,U79))","v":23},"X",null,23,23,"Northwest","QAPR0.5","A","P","-2.699","1.073","1.564"]
["QAPR0.8=10-2.752A1.079P1.406","OLS",25,"--","--","--","--","--",39.230913082500145,92.61,0.98683891710417537,null,null,null,null,null,21,null,null,null,8,17,23,"X",null,23,23,"Northwest","QAPR0.8","A","P","-2.752","1.079","1.406"]
["QAPRMEAN=10-2.817A1.064P1.74","OLS",25,"--","--","--","--","--",39.230913082500145,92.73,0.95041177988543357,null,null,null,null,null,22,null,null,null,9,18,24,"X",null,24,24,"Northwest","QAPRMEAN","A","P","-2.817","1.064","1.74"]
["QMAY0.2=10-3.18A1.122P2.288","OLS",26,"--","--","--","--","--",40.768554789241762,93.78,0.91749111191386723,null,null,null,null,null,23,null,null,null,8,16,22,"X",null,22,22,"Northwest","QMAY0.2","A","P","-3.18","1.122","2.288"]
["QMAY0.5=10-3.646A1.146P2.408","OLS",26,"--","--","--","--","--",41.521936364144445,93.8,0.93099015552531394,null,null,null,null,null,24,null,null,null,8,17,23,"X",null,23,23,"Northwest","QMAY0.5","A","P","-3.646","1.146","2.408"]
["QMAY0.8=10-4.498A1.208P2.68","OLS",26,"--","--","--","--","--",45.858813208494141,93.6,0.96780300868425539,null,null,null,null,null,25,null,null,null,8,17,23,"X",null,23,23,"Northwest","QMAY0.8","A","P","-4.498","1.208","2.68"]
["QMAYMEAN=10-3.263A1.129P2.234","OLS",26,"--","--","--","--","--",40.005084069492796,93.97,0.92864065870554713,null,null,null,null,null,26,null,null,null,9,18,24,"X",null,24,24,"Northwest","QMAYMEAN","A","P","-3.263","1.129","2.234"]
["QJUN0.2=10-2.985A1.13P2.204","OLS",26,"--","--","--","--","--",37.647729371743736,94.56,0.93272227069816915,null,null,null,null,null,27,null,null,null,8,17,22,"X",null,22,22,"Northwest","QJUN0.2","A","P","-2.985","1.13","2.204"]
["QJUN0.5=10-3.648A1.134P2.475","OLS",26,"--","--","--","--","--",33.446316852914677,95.71,0.91240174656750805,null,null,null,null,null,28,null,null,null,8,17,23,"X",null,23,23,"Northwest","QJUN0.5","A","P","-3.648","1.134","2.475"]
["QJUN0.8=10-4.72A1.163P2.939","OLS",26,"--","--","--","--","--",36.837172815858779,95.6,0.89973732059197531,null,null,null,null,null,29,null,null,null,8,16,22,"X",null,22,22,"Northwest","QJUN0.8","A","P","-4.72","1.163","2.939"]
["QJUNMEAN=10-3.208A1.127P2.253","OLS",26,"--","--","--","--","--",39.230913082500145,94.24,0.92538563221297643,null,null,null,null,null,30,null,null,null,9,18,24,"X",null,24,24,"Northwest","QJUNMEAN","A","P","-3.208","1.127","2.253"]
["QJUL0.2=10-3.531A1.084P2.348","OLS",26,"--","--","--","--","--",36.012807865166288,94.8,0.87428808832163996,null,null,null,null,null,31,null,null,null,8,17,23,"X",null,23,23,"Northwest","QJUL0.2","A","P","-3.531","1.084","2.348"]
["QJUL0.5=10-4.133A1.102P2.535","OLS",26,"--","--","--","--","--",39.230913082500145,94.19,0.87503885919506597,null,null,null,null,null,32,null,null,null,8,17,23,"X",null,23,23,"Northwest","QJUL0.5","A","P","-4.133","1.102","2.535"]
["QJUL0.8=10-5.12A1.146P2.926","OLS",26,"--","--","--","--","--",52.555165433651716,91.59,0.88461255029574126,null,null,null,null,null,33,null,null,null,8,16,22,"X",null,22,22,"Northwest","QJUL0.8","A","P","-5.12","1.146","2.926"]
["QJULMEAN=10-3.761A1.091P2.387","OLS",26,"--","--","--","--","--",36.837172815858779,94.53,0.87799148195497678,null,null,null,null,null,34,null,null,null,9,18,24,"X",null,24,24,"Northwest","QJULMEAN","A","P","-3.761","1.091","2.387"]
["QAUG0.2=10-3.034A1.023P1.855","OLS",26,"--","--","--","--","--",47.927857432976431,90.06,0.85729103163015563,null,null,null,null,null,35,null,null,null,8,17,23,"X",null,23,23,"Northwest","QAUG0.2","A","P","-3.034","1.023","1.855"]
["QAUG0.5=10-3.76A1.056P2.148","OLS",26,"--","--","--","--","--",55.096203033983784,88.45,0.8633982108744539,null,null,null,null,null,36,null,null,null,8,16,22,"X",null,22,22,"Northwest","QAUG0.5","A","P","-3.76","1.056","2.148"]
["QAUG0.8=10-5.133A1.13P2.759","OLS",26,"--","--","--","--","--",75.455872711666558,84.83,0.88280636506275467,null,null,null,null,null,37,null,null,null,8,17,22,"X",null,22,22,"Northwest","QAUG0.8","A","P","-5.133","1.13","2.759"]
["QAUGMEAN=10-3.435A1.038P2.004","OLS",26,"--","--","--","--","--",51.258487171657649,89.31,0.85839774077192732,null,null,null,null,null,38,null,null,null,9,18,24,"X",null,24,24,"Northwest","QAUGMEAN","A","P","-3.435","1.038","2.004"]
["QSEP0.2=10-2.812A0.978P1.704","OLS",26,"--","--","--","--","--",47.244611829214058,89.36,0.8255402081065244,null,null,null,null,null,39,null,null,null,8,17,23,"X",null,23,23,"Northwest","QSEP0.2","A","P","-2.812","0.978","1.704"]
["QSEP0.5=10-3.38A1.038P1.851","OLS",26,"--","--","--","--","--",52.555165433651716,88.65,0.87275990234037992,null,null,null,null,null,40,null,null,null,8,16,22,"X",null,22,22,"Northwest","QSEP0.5","A","P","-3.38","1.038","1.851"]
["QSEP0.8=10-4.544A1.125P2.331","OLS",26,"--","--","--","--","--",68.178701445990114,85.95,0.91669932886744476,null,null,null,null,null,41,null,null,null,8,17,23,"X",null,23,23,"Northwest","QSEP0.8","A","P","-4.544","1.125","2.331"]
["QSEPMEAN=10-3.307A1.014P1.886","OLS",26,"--","--","--","--","--",45.155627502771047,90.85,0.8454946586828026,null,null,null,null,null,42,null,null,null,9,18,24,"X",null,24,24,"Northwest","QSEPMEAN","A","P","-3.307","1.014","1.886"]
["QOCT0.2=10-3.027A0.932P1.947","OLS",26,"--","--","--","--","--",36.012807865166288,92.93,0.75766259238950906,null,null,null,null,null,43,null,null,null,8,17,23,"X",null,23,23,"Northwest","QOCT0.2","A","P","-3.027","0.932","1.947"]
["QOCT0.5=10-2.918A0.966P1.698","OLS",26,"--","--","--","--","--",38.445372996709118,92.4,0.81379831001976155,null,null,null,null,null,44,null,null,null,8,17,23,"X",null,23,23,"Northwest","QOCT0.5","A","P","-2.918","0.966","1.698"]
["QOCT0.8=10-3.16A1.037P1.618","OLS",26,"--","--","--","--","--",51.258487171657649,88.76,0.89221585675063642,null,null,null,null,null,45,null,null,null,8,16,22,"X",null,22,22,"Northwest","QOCT0.8","A","P","-3.16","1.037","1.618"]
["QOCTMEAN=10-3.187A0.945P1.947","OLS",26,"--","--","--","--","--",33.446316852914677,93.85,0.7704340241324501,null,null,null,null,null,46,null,null,null,9,18,24,"X",null,24,24,"Northwest","QOCTMEAN","A","P","-3.187","0.945","1.947"]
["QNOV0.2=10-3.331A0.975P2.051","OLS",21,"--","--","--","--","--",27.758213959367033,95.41,0.77176046809423915,null,null,null,null,null,47,null,null,null,8,17,23,"X",null,23,23,"Northwest","QNOV0.2","A","P","-3.331","0.975","2.051"]
["QNOV0.5=10-3.052A0.95P1.797","OLS",21,"--","--","--","--","--",29.754596059843468,94.46,0.77148606277352094,null,null,null,null,null,48,null,null,null,8,17,22,"X",null,22,22,"Northwest","QNOV0.5","A","P","-3.052","0.95","1.797"]
["QNOV0.8=10-2.642A0.957P1.4","OLS",21,"--","--","--","--","--",37.647729371743736,91.48,0.8178547614944589,null,null,null,null,null,49,null,null,null,8,17,23,"X",null,23,23,"Northwest","QNOV0.8","A","P","-2.642","0.957","1.4"]
["QNOVMEAN=10-3.265A0.975P1.933","OLS",21,"--","--","--","--","--",25.630294240815154,95.89,0.78366634079045494,null,null,null,null,null,50,null,null,null,9,18,24,"X",null,24,24,"Northwest","QNOVMEAN","A","P","-3.265","0.975","1.933"]
["QDEC0.2=10-2.888A0.971P1.7","OLS",19,"--","--","--","--","--",31.644549718377686,94.17,0.79432063181860157,null,null,null,null,null,51,null,null,null,8,17,23,"X",null,23,23,"Northwest","QDEC0.2","A","P","-2.888","0.971","1.7"]
["QDEC0.5=10-2.851A0.965P1.573","OLS",19,"--","--","--","--","--",34.318557809831169,93.34,0.80165775392819494,null,null,null,null,null,52,null,null,null,8,17,23,"X",null,23,23,"Northwest","QDEC0.5","A","P","-2.851","0.965","1.573"]
["QDEC0.8=10-2.898A0.983P1.452","OLS",19,"--","--","--","--","--",40.005084069492796,91.54,0.83191815435624261,null,null,null,null,null,53,null,null,null,8,17,23,"X",null,23,23,"Northwest","QDEC0.8","A","P","-2.898","0.983","1.452"]
["QDECMEAN=10-2.93A0.964P1.667","OLS",19,"--","--","--","--","--",31.644549718377686,94.16,0.79143245317513611,null,null,null,null,null,54,null,null,null,9,17,23,"X",null,23,23,"Northwest","QDECMEAN","A","P","-2.93","0.964","1.667"]
["Upper Yellowstone-Central Mountain hydrologic region"]
["QAL7Q10=10-9.113A1.017P5.411","GLS",35,0.26500000000000001,0.29099999999999998,175.6,191.8,61.86,"--","--",0.66116492310579411,null,null,null,null,null,1,null,null,null,{"$f":"FIND(\"=\",A115)","v":8},{"$f":"FIND(V$3,$A115,U115)","v":17},{"$f":"IF(X115<>\"X\",\"X\",FIND(W$3,$A115,U115))","v":23},"X",null,{"$f":"IF(W115=\"X\",FIND(\"(\",A115),W115)","v":23},{"$f":"IF(W115=\"X\",FIND(\")\",A115),W115)","v":23},"Upper Yellowstone-Central Mountain","QAL7Q10","A",{"$f":"IF(W115=\"X\",\"SLP50\",\"P\")","v":"P"},{"$f":"MID(A115,U115+3,V115-U115-3)","v":"-9.113"},{"$f":"MID(A115,V115+1,Z115-V115-1)","v":"1.017"},"5.411"]
["QS214Q5=10-6.949A0.807P4.523","GLS",49,0.182,0.19500000000000001,127.56,134.81,64.53,"--","--",0.63618450205258303,null,null,null,null,null,2,null,null,null,8,17,23,"X",null,23,23,"Upper Yellowstone-Central Mountain","QS214Q5","A","P","-6.949","0.807","4.523"]
["QA0.2=10-4.537A0.947P3.184","OLS",40,"--","--","--","--","--",44.445124250513942,90.55,0.8960276413512942,null,null,null,null,null,3,null,null,null,6,15,21,"X",null,21,21,"Upper Yellowstone-Central Mountain","QA0.2","A","P","-4.537","0.947","3.184"]
["QA0.5=10-3.441A0.902P2.253","OLS",40,"--","--","--","--","--",50.602958909477245,85.87,0.86588042972203116,null,null,null,null,null,4,null,null,null,6,15,21,"X",null,21,21,"Upper Yellowstone-Central Mountain","QA0.5","A","P","-3.441","0.902","2.253"]
["QA0.8=10-4.34A0.879P2.684","OLS",40,"--","--","--","--","--",68.178701445990114,78.739999999999995,0.83610116501233678,null,null,null,null,null,5,null,null,null,6,14,20,"X",null,20,20,"Upper Yellowstone-Central Mountain","QA0.8","A","P","-4.34","0.879","2.684"]
["QAMEAN=10-5.116A0.947P3.492","OLS",40,"--","--","--","--","--",47.244611829214058,90.14,0.89060684240746968,null,null,null,null,null,6,null,null,null,7,16,22,"X",null,22,22,"Upper Yellowstone-Central Mountain","QAMEAN","A","P","-5.116","0.947","3.492"]
["QJAN0.2=10-3.596A0.923P2.169","OLS",40,"--","--","--","--","--",94.83669485987825,68.959999999999994,0.88786823432033235,null,null,null,null,null,7,null,null,null,8,17,23,"X",null,23,23,"Upper Yellowstone-Central Mountain","QJAN0.2","A","P","-3.596","0.923","2.169"]
["QJAN0.5=10-4.163A0.919P2.488","OLS",40,"--","--","--","--","--",108.63425062940681,65.42,0.87920002663889407,null,null,null,null,null,8,null,null,null,8,17,23,"X",null,23,23,"Upper Yellowstone-Central Mountain","QJAN0.5","A","P","-4.163","0.919","2.488"]
["QJAN0.8=10-4.905A0.918P2.914","OLS",40,"--","--","--","--","--",126.91722347364353,62.17,0.87124372104511127,null,null,null,null,null,9,null,null,null,8,17,23,"X",null,23,23,"Upper Yellowstone-Central Mountain","QJAN0.8","A","P","-4.905","0.918","2.914"]
["QJANMEAN=10-3.879A0.92P2.304","OLS",40,"--","--","--","--","--",103.32282298334357,66.45,0.88325264307789242,null,null,null,null,null,10,null,null,null,9,18,23,"X",null,23,23,"Upper Yellowstone-Central Mountain","QJANMEAN","A","P","-3.879","0.92",{"$f":"MID(A124,AA124+1,LEN(A124)-AA124)","v":"2.304"}]
["QFEB0.2=10-2.684A0.933P1.518","OLS",40,"--","--","--","--","--",94.83669485987825,67.69,0.90847213945438388,null,null,null,null,null,11,null,null,null,8,17,23,"X",null,23,23,"Upper Yellowstone-Central Mountain","QFEB0.2","A","P","-2.684","0.933","1.518"]
["QFEB0.5=10-3.566A0.932P2.055","OLS",40,"--","--","--","--","--",105.97661232140085,65.430000000000007,0.89911736055283542,null,null,null,null,null,12,null,null,null,8,17,23,"X",null,23,23,"Upper Yellowstone-Central Mountain","QFEB0.5","A","P","-3.566","0.932","2.055"]
["QFEB0.8=10-4.591A0.928P2.679","OLS",40,"--","--","--","--","--",130.19936727858828,60.9,0.88448278431546801,null,null,null,null,null,13,null,null,null,8,17,23,"X",null,23,23,"Upper Yellowstone-Central Mountain","QFEB0.8","A","P","-4.591","0.928","2.679"]
["QFEBMEAN=10-2.794A0.923P1.56","OLS",40,"--","--","--","--","--",100.14104654672269,65.67,0.89765523456304697,null,null,null,null,null,14,null,null,null,9,18,24,"X",null,24,24,"Upper Yellowstone-Central Mountain","QFEBMEAN","A","P","-2.794","0.923","1.56"]
["QMAR0.2=10-1.196A0.972P0.469","OLS",41,"--","--","--","--","--",90.049615880113905,69.81,0.96549378876307324,null,null,null,null,null,15,null,null,null,8,17,23,"X",null,23,23,"Upper Yellowstone-Central Mountain","QMAR0.2","A","P","-1.196","0.972","0.469"]
["QMAR0.5=10-2.432A0.977P1.217","OLS",41,"--","--","--","--","--",100.14104654672269,67.11,0.95913495027364504,null,null,null,null,null,16,null,null,null,8,17,23,"X",null,23,23,"Upper Yellowstone-Central Mountain","QMAR0.5","A","P","-2.432","0.977","1.217"]
["QMAR0.8=10-3.589A0.99P1.892","OLS",41,"--","--","--","--","--",128.55571856508612,61.12,0.96212816060735928,null,null,null,null,null,17,null,null,null,8,17,22,"X",null,22,22,"Upper Yellowstone-Central Mountain","QMAR0.8","A","P","-3.589","0.99","1.892"]
["QMARMEAN=10-1.508A0.974P0.629","OLS",41,"--","--","--","--","--",96.428890119392534,67.69,0.96434441066035725,null,null,null,null,null,18,null,null,null,9,18,24,"X",null,24,24,"Upper Yellowstone-Central Mountain","QMARMEAN","A","P","-1.508","0.974","0.629"]
["QAPR0.2=10-2.256A0.887P1.573","OLS",46,"--","--","--","--","--",74.903952042977409,73.91,0.89109361584788116,null,null,null,null,null,19,null,null,null,8,17,23,"X",null,23,23,"Upper Yellowstone-Central Mountain","QAPR0.2","A","P","-2.256","0.887","1.573"]
["QAPR0.5=10-2.601A0.894P1.636","OLS",46,"--","--","--","--","--",80.920396996937811,71.95,0.89899321123219,null,null,null,null,null,20,null,null,null,8,17,23,{"$f":"IF(ISERROR(FIND(X$3,$A134)),\"X\",FIND(X$3,$A134))","v":"X"},null,23,23,"Upper Yellowstone-Central Mountain","QAPR0.5","A","P","-2.601","0.894","1.636"]
["QAPR0.8=10-3.257A0.934P1.875","OLS",46,"--","--","--","--","--",100.14104654672269,67.41,0.9391342706395952,null,null,null,null,null,21,null,null,null,8,17,23,"X",null,23,23,"Upper Yellowstone-Central Mountain","QAPR0.8","A","P","-3.257","0.934","1.875"]
["QAPRMEAN=10-2.475A0.896P1.629","OLS",46,"--","--","--","--","--",72.684388910763218,75.28,0.9001523929097931,null,null,null,null,null,22,null,null,null,9,18,24,"X",null,24,24,"Upper Yellowstone-Central Mountain","QAPRMEAN","A","P","-2.475","0.896","1.629"]
["QMAY0.2=10-4.698A0.958P3.544","OLS",49,"--","--","--","--","--",67.036005309998643,83.58,0.94142688985471945,null,null,null,null,null,23,null,null,null,8,17,23,"X",null,23,23,"Upper Yellowstone-Central Mountain","QMAY0.2","A","P","-4.698","0.958","3.544"]
["QMAY0.5=10-5.107A0.954P3.644","OLS",49,"--","--","--","--","--",64.727733027560731,84.62,0.93711965318434909,null,null,null,null,null,24,null,null,null,8,17,23,"X",null,23,23,"Upper Yellowstone-Central Mountain","QMAY0.5","A","P","-5.107","0.954","3.644"]
["QMAY0.8=10-5.544A0.939P3.743","OLS",49,"--","--","--","--","--",80.920396996937811,79.27,0.92187215961275004,null,null,null,null,null,25,null,null,null,8,17,23,"X",null,23,23,"Upper Yellowstone-Central Mountain","QMAY0.8","A","P","-5.544","0.939","3.743"]
["QMAYMEAN=10-4.764A0.941P3.499","OLS",49,"--","--","--","--","--",63.561056954656124,84.53,0.92459526507782397,null,null,null,null,null,26,null,null,null,9,18,24,"X",null,24,24,"Upper Yellowstone-Central Mountain","QMAYMEAN","A","P","-4.764","0.941","3.499"]
["QJUN0.2=10-5.968A1.027P4.419","OLS",49,"--","--","--","--","--",65.885859146084741,87.17,1.0062010977015965,null,null,null,null,null,27,null,null,null,8,17,23,"X",null,23,23,"Upper Yellowstone-Central Mountain","QJUN0.2","A","P","-5.968","1.027","4.419"]
["QJUN0.5=10-6.964A1.032P4.948","OLS",49,"--","--","--","--","--",62.385216362602037,89.25,1.0090822697772708,null,null,null,null,null,28,null,null,null,8,17,23,"X",null,23,23,"Upper Yellowstone-Central Mountain","QJUN0.5","A","P","-6.964","1.032","4.948"]
["QJUN0.8=10-8.28A1.026P5.688","OLS",49,"--","--","--","--","--",73.79663140108066,87.81,0.99965324901568176,null,null,null,null,null,29,null,null,null,8,16,22,"X",null,22,22,"Upper Yellowstone-Central Mountain","QJUN0.8","A","P","-8.28","1.026","5.688"]
["QJUNMEAN=10-6.2A1.006P4.511","OLS",49,"--","--","--","--","--",58.795779438743267,89.23,0.98502417490802929,null,null,null,null,null,30,null,null,null,9,16,22,"X",null,22,22,"Upper Yellowstone-Central Mountain","QJUNMEAN","A","P","-6.2","1.006","4.511"]
["QJUL0.2=10-7.302A0.978P5.168","OLS",49,"--","--","--","--","--",84.698362659568161,83.25,0.95412328999029727,null,null,null,null,null,31,null,null,null,8,17,23,"X",null,23,23,"Upper Yellowstone-Central Mountain","QJUL0.2","A","P","-7.302","0.978","5.168"]
["QJUL0.5=10-7.862A0.923P5.472","OLS",49,"--","--","--","--","--",102.79238525470653,79.09,0.89774940635090728,null,null,null,null,null,32,null,null,null,8,17,23,"X",null,23,23,"Upper Yellowstone-Central Mountain","QJUL0.5","A","P","-7.862","0.923","5.472"]
["QJUL0.8=10-9.264A0.881P6.324","OLS",49,"--","--","--","--","--",160.30177661589124,71.33,0.85184680204820939,null,null,null,null,null,33,null,null,null,8,17,23,"X",null,23,23,"Upper Yellowstone-Central Mountain","QJUL0.8","A","P","-9.264","0.881","6.324"]
["QJULMEAN=10-7.403A0.952P5.176","OLS",49,"--","--","--","--","--",87.914306531696411,82.12,0.92746500427245604,null,null,null,null,null,34,null,null,null,9,18,24,"X",null,24,24,"Upper Yellowstone-Central Mountain","QJULMEAN","A","P","-7.403","0.952","5.176"]
["QAUG0.2=10-6.273A0.871P4.352","OLS",49,"--","--","--","--","--",103.32282298334357,73.56,0.85079362651860058,null,null,null,null,null,35,null,null,null,8,17,23,"X",null,23,23,"Upper Yellowstone-Central Mountain","QAUG0.2","A","P","-6.273","0.871","4.352"]
["QAUG0.5=10-7.497A0.862P5.073","OLS",49,"--","--","--","--","--",165.65420787500557,64.17,0.83834307717190981,null,null,null,null,null,36,null,null,null,8,17,23,"X",null,23,23,"Upper Yellowstone-Central Mountain","QAUG0.5","A","P","-7.497","0.862","5.073"]
["QAUG0.8=10-9.032A0.776P6.129","OLS",49,"--","--","--","--","--",207.67288690053843,62.67,0.74772212295250629,null,null,null,null,null,37,null,null,null,8,17,23,"X",null,23,23,"Upper Yellowstone-Central Mountain","QAUG0.8","A","P","-9.032","0.776","6.129"]
["QAUGMEAN=10-6.788A0.854P4.644","OLS",49,"--","--","--","--","--",110.76416073180637,72.650000000000006,0.83203340437416806,null,null,null,null,null,38,null,null,null,9,18,24,"X",null,24,24,"Upper Yellowstone-Central Mountain","QAUGMEAN","A","P","-6.788","0.854","4.644"]
["QSEP0.2=10-5.342A0.861P3.637","OLS",49,"--","--","--","--","--",111.8306377111309,67.69,0.84425109927024777,null,null,null,null,null,39,null,null,null,8,17,23,"X",null,23,23,"Upper Yellowstone-Central Mountain","QSEP0.2","A","P","-5.342","0.861","3.637"]
["QSEP0.5=10-6.445A0.838P4.323","OLS",49,"--","--","--","--","--",172.30753966423686,58.4,0.79520324421821886,null,null,null,null,null,40,null,null,null,8,17,23,"X",null,23,23,"Upper Yellowstone-Central Mountain","QSEP0.5","A","P","-6.445","0.838","4.323"]
["QSEP0.8=10-7.739A0.791P5.16","OLS",49,"--","--","--","--","--",214.52475252573274,56.63,0.76673414740638524,null,null,null,null,null,41,null,null,null,8,17,23,"X",null,23,23,"Upper Yellowstone-Central Mountain","QSEP0.8","A","P","-7.739","0.791","5.16"]
["QSEPMEAN=10-5.849A0.851P3.924","OLS",49,"--","--","--","--","--",123.65480682291472,65.88,0.832739759746013,null,null,null,null,null,42,null,null,null,9,18,24,"X",null,24,24,"Upper Yellowstone-Central Mountain","QSEPMEAN","A","P","-5.849","0.851","3.924"]
["QOCT0.2=10-4.311A0.886P2.867","OLS",49,"--","--","--","--","--",93.243080562804792,70.44,0.8723993453525094,null,null,null,null,null,43,null,null,null,8,17,23,"X",null,23,23,"Upper Yellowstone-Central Mountain","QOCT0.2","A","P","-4.311","0.886","2.867"]
["QOCT0.5=10-4.715A0.867P3.086","OLS",49,"--","--","--","--","--",113.96707867319596,64.63,0.85223278170823225,null,null,null,null,null,44,null,null,null,8,17,23,"X",null,23,23,"Upper Yellowstone-Central Mountain","QOCT0.5","A","P","-4.715","0.867","3.086"]
["QOCT0.8=10-5.806A0.841P3.772","OLS",49,"--","--","--","--","--",165.05553397423455,56.47,0.82302953487943487,null,null,null,null,null,45,null,null,null,8,17,23,"X",null,23,23,"Upper Yellowstone-Central Mountain","QOCT0.8","A","P","-5.806","0.841","3.772"]
["QOCTMEAN=10-4.711A0.875P3.09","OLS",49,"--","--","--","--","--",104.38397882584174,67.61,0.86082907110129747,null,null,null,null,null,46,null,null,null,9,18,24,"X",null,24,24,"Upper Yellowstone-Central Mountain","QOCTMEAN","A","P","-4.711","0.875","3.09"]
["QNOV0.2=10-3.932A0.918P2.504","OLS",45,"--","--","--","--","--",85.772324018920813,72.099999999999994,0.88642448528123807,null,null,null,null,null,47,null,null,null,8,17,23,"X",null,23,23,"Upper Yellowstone-Central Mountain","QNOV0.2","A","P","-3.932","0.918","2.504"]
["QNOV0.5=10-4.288A0.912P2.684","OLS",45,"--","--","--","--","--",98.550405149022083,68.19,0.87898121178458877,null,null,null,null,null,48,null,null,null,8,17,23,"X",null,23,23,"Upper Yellowstone-Central Mountain","QNOV0.5","A","P","-4.288","0.912","2.684"]
["QNOV0.8=10-4.992A0.913P3.079","OLS",45,"--","--","--","--","--",120.41028530016978,63.43,0.87423921726987652,null,null,null,null,null,49,null,null,null,8,17,23,"X",null,23,23,"Upper Yellowstone-Central Mountain","QNOV0.8","A","P","-4.992","0.913","3.079"]
["QNOVMEAN=10-4.312A0.924P2.69","OLS",45,"--","--","--","--","--",93.243080562804792,70.23,0.89001034604049512,null,null,null,null,null,50,null,null,null,9,18,24,"X",null,24,24,"Upper Yellowstone-Central Mountain","QNOVMEAN","A","P","-4.312","0.924","2.69"]
["QDEC0.2=10-4.202A0.954P2.567","OLS",41,"--","--","--","--","--",88.448703179386712,73.040000000000006,0.91663260502719002,null,null,null,null,null,51,null,null,null,8,17,23,"X",null,23,23,"Upper Yellowstone-Central Mountain","QDEC0.2","A","P","-4.202","0.954","2.567"]
["QDEC0.5=10-4.601A0.957P2.759","OLS",41,"--","--","--","--","--",103.32282298334357,69.03,0.91652179626360175,null,null,null,null,null,52,null,null,null,8,17,23,"X",null,23,23,"Upper Yellowstone-Central Mountain","QDEC0.5","A","P","-4.601","0.957","2.759"]
["QDEC0.8=10-5.075A0.946P3.015","OLS",41,"--","--","--","--","--",119.33242388197773,65.12,0.90167313853257824,null,null,null,null,null,53,null,null,null,8,17,23,"X",null,23,23,"Upper Yellowstone-Central Mountain","QDEC0.8","A","P","-5.075","0.946","3.015"]
["QDECMEAN=10-4.394A0.956P2.632","OLS",41,"--","--","--","--","--",94.83669485987825,71.13,0.91722426172305149,null,null,null,null,null,54,null,null,null,9,18,24,"X",null,24,24,"Upper Yellowstone-Central Mountain","QDECMEAN","A","P","-4.394","0.956","2.632"]
["Southwest hydrologic region"]
["QAL7Q10=10-5.309A1.725(SLP50 + 1)2.152","GLS",14,0.216,0.26400000000000001,146.44,174.5,73.14,"--","--",1.3341556217688353,null,null,null,null,null,1,null,null,null,{"$f":"FIND(\"=\",A170)","v":8},{"$f":"FIND(V$3,$A170,U170)","v":17},{"$f":"IF(X170<>\"X\",\"X\",FIND(W$3,$A170,U170))","v":"X"},{"$f":"IF(ISERROR(FIND(X$3,$A170)),\"X\",FIND(X$3,$A170))","v":24},null,{"$f":"IF(W170=\"X\",FIND(\"(\",A170),W170)","v":23},{"$f":"IF(W170=\"X\",FIND(\")\",A170),W170)","v":33},"Southwest","QAL7Q10","A",{"$f":"IF(W170=\"X\",\"SLP50\",\"P\")","v":"SLP50"},{"$f":"MID(A170,U170+3,V170-U170-3)","v":"-5.309"},{"$f":"MID(A170,V170+1,Z170-V170-1)","v":"1.725"},{"$f":"MID(A170,AA170+1,LEN(A170)-AA170)","v":"2.152"}]
["QS214Q5=10-6.998A1.135P3.934","GLS",23,0.29299999999999998,0.33200000000000002,193.06,219.61,46.76,"--","--",0.84069337579333159,null,null,null,null,null,2,null,null,null,8,17,23,"X",null,23,23,"Southwest","QS214Q5","A","P","-6.998","1.135","3.934"]
["QA0.2=10-3.693A0.827P2.804","OLS",14,"--","--","--","--","--",39.230913082500145,86.48,0.64758091971380038,null,null,null,null,null,3,null,null,null,6,15,21,"X",null,21,21,"Southwest","QA0.2","A","P","-3.693","0.827","2.804"]
["QA0.5=10-2.413A0.753P1.759","OLS",14,"--","--","--","--","--",36.837172815858779,85.97,0.64064272998961103,null,null,null,null,null,4,null,null,null,6,15,21,"X",null,21,21,"Southwest","QA0.5","A","P","-2.413","0.753","1.759"]
["QA0.8=10-2.924A0.794P1.835","OLS",14,"--","--","--","--","--",40.768554789241762,84.68,0.6769225183039812,null,null,null,null,null,5,null,null,null,6,15,21,"X",null,21,21,"Southwest","QA0.8","A","P","-2.924","0.794","1.835"]
["QAMEAN=10-4.335A0.962P2.946","OLS",14,"--","--","--","--","--",25.630294240815154,94.98,0.77432092700037103,null,null,null,null,null,6,null,null,null,7,16,22,"X",null,22,22,"Southwest","QAMEAN","A","P","-4.335","0.962","2.946"]
["QJAN0.2=10-2.126A1.149(SLP50 + 1)0.975","OLS",14,"--","--","--","--","--",36.012807865166288,93.4,0.95503186924260652,null,null,null,null,null,7,null,null,null,8,17,"X",24,null,23,33,"Southwest","QJAN0.2","A","SLP50","-2.126","1.149","0.975"]
["QJAN0.5=10-2.645A1.239(SLP50 + 1)1.168","OLS",14,"--","--","--","--","--",45.858813208494141,91.19,1.0066626673820982,null,null,null,null,null,8,null,null,null,8,17,"X",24,null,23,33,"Southwest","QJAN0.5","A","SLP50","-2.645","1.239","1.168"]
["QJAN0.8=10-3.331A1.351(SLP50 + 1)1.451","OLS",14,"--","--","--","--","--",60.602803839314724,88.22,1.0631646599621827,null,null,null,null,null,9,null,null,null,8,17,"X",24,null,23,33,"Southwest","QJAN0.8","A","SLP50","-3.331","1.351","1.451"]
["QJANMEAN=10-2.442A1.193(SLP50 + 1)1.093","OLS",14,"--","--","--","--","--",41.521936364144445,92.11,0.97581146284887599,null,null,null,null,null,10,null,null,null,9,18,"X",25,null,24,34,"Southwest","QJANMEAN","A","SLP50","-2.442","1.193","1.093"]
["QFEB0.2=10-2.276A1.214(SLP50 + 1)0.964","OLS",14,"--","--","--","--","--",42.265788927328785,92.11,1.0219215530993424,null,null,null,null,null,11,null,null,null,8,17,"X",24,null,23,33,"Southwest","QFEB0.2","A","SLP50","-2.276","1.214","0.964"]
["QFEB0.5=10-2.631A1.256(SLP50 + 1)1.116","OLS",14,"--","--","--","--","--",49.276472527795462,90.51,1.0338039135186454,null,null,null,null,null,12,null,null,null,8,17,"X",24,null,23,33,"Southwest","QFEB0.5","A","SLP50","-2.631","1.256","1.116"]
["QFEB0.8=10-3.286A1.355(SLP50 + 1)1.395","OLS",14,"--","--","--","--","--",61.79365388156458,88.04,1.0777932082700763,null,null,null,null,null,13,null,null,null,8,17,"X",24,null,23,33,"Southwest","QFEB0.8","A","SLP50","-3.286","1.355","1.395"]
["QFEBMEAN=10-2.555A1.248(SLP50 + 1)1.086","OLS",14,"--","--","--","--","--",42.265788927328785,92.59,1.0323563421479405,null,null,null,null,null,14,null,null,null,9,18,"X",25,null,24,34,"Southwest","QFEBMEAN","A","SLP50","-2.555","1.248","1.086"]
["QMAR0.2=10-1.493A1.11(SLP50 + 1)0.555","OLS",17,"--","--","--","--","--",31.644549718377686,94.23,0.99399857069128217,null,null,null,null,null,15,null,null,null,8,17,"X",23,null,22,32,"Southwest","QMAR0.2","A","SLP50","-1.493","1.11","0.555"]
["QMAR0.5=10-2.138A1.206(SLP50 + 1)0.83","OLS",17,"--","--","--","--","--",40.768554789241762,91.81,1.0324435334342366,null,null,null,null,null,16,null,null,null,8,17,"X",24,null,23,33,"Southwest","QMAR0.5","A","SLP50","-2.138","1.206","0.83"]
["QMAR0.8=10-2.909A1.336(SLP50 + 1)1.162","OLS",17,"--","--","--","--","--",56.343194938570662,88.31,1.0929153130414699,null,null,null,null,null,17,null,null,null,8,17,"X",24,null,23,33,"Southwest","QMAR0.8","A","SLP50","-2.909","1.336","1.162"]
["QMARMEAN=10-1.739A1.143(SLP50 + 1)0.646","OLS",17,"--","--","--","--","--",30.711609287771889,94.56,1.008084419681005,null,null,null,null,null,18,null,null,null,9,18,"X",25,null,24,34,"Southwest","QMARMEAN","A","SLP50","-1.739","1.143","0.646"]
["QAPR0.2=10-3.434A1.096P2.189","OLS",23,"--","--","--","--","--",39.230913082500145,90.93,0.92418033350927209,null,null,null,null,null,19,null,null,null,8,17,23,"X",null,23,23,"Southwest","QAPR0.2","A","P","-3.434","1.096","2.189"]
["QAPR0.5=10-3.267A1.115P1.847","OLS",23,"--","--","--","--","--",26.712630504638501,95.66,0.97054354380221253,null,null,null,null,null,20,null,null,null,8,17,23,"X",null,23,23,"Southwest","QAPR0.5","A","P","-3.267","1.115","1.847"]
["QAPR0.8=10-2.935A1.105P1.447","OLS",23,"--","--","--","--","--",29.754596059843468,94.84,0.99191220414891845,null,null,null,null,null,21,null,null,null,8,17,23,"X",null,23,23,"Southwest","QAPR0.8","A","P","-2.935","1.105","1.447"]
["QAPRMEAN=10-3.343A1.093P2.022","OLS",23,"--","--","--","--","--",30.711609287771889,94.09,0.93410019206152883,null,null,null,null,null,22,null,null,null,9,18,24,"X",null,24,24,"Southwest","QAPRMEAN","A","P","-3.343","1.093","2.022"]
["QMAY0.2=10-3.111A0.886P2.593","OLS",24,"--","--","--","--","--",57.576045789876552,77.87,0.70326619047410988,null,null,null,null,null,23,null,null,null,8,17,23,"X",null,23,23,"Southwest","QMAY0.2","A","P","-3.111","0.886","2.593"]
["QMAY0.5=10-3.494A0.894P2.672","OLS",24,"--","--","--","--","--",53.833942282648891,80.12,0.70546011395539077,null,null,null,null,null,24,null,null,null,8,17,23,"X",null,23,23,"Southwest","QMAY0.5","A","P","-3.494","0.894","2.672"]
["QMAY0.8=10-3.888A0.936P2.679","OLS",24,"--","--","--","--","--",47.927857432976431,84.39,0.74733482090373038,null,null,null,null,null,25,null,null,null,8,17,23,"X",null,23,23,"Southwest","QMAY0.8","A","P","-3.888","0.936","2.679"]
["QMAYMEAN=10-3.245A0.892P2.558","OLS",24,"--","--","--","--","--",53.833942282648891,80.05,0.71150423764575887,null,null,null,null,null,26,null,null,null,9,18,24,"X",null,24,24,"Southwest","QMAYMEAN","A","P","-3.245","0.892","2.558"]
["QJUN0.2=10-3.233A0.898P2.7","OLS",24,"--","--","--","--","--",47.244611829214058,83.72,0.70722349869697831,null,null,null,null,null,27,null,null,null,8,17,23,"X",null,23,23,"Southwest","QJUN0.2","A","P","-3.233","0.898","2.7"]
["QJUN0.5=10-4.127A0.917P3.119","OLS",24,"--","--","--","--","--",47.244611829214058,84.59,0.69748193038880169,null,null,null,null,null,28,null,null,null,8,17,23,"X",null,23,23,"Southwest","QJUN0.5","A","P","-4.127","0.917","3.119"]
["QJUN0.8=10-4.929A0.916P3.467","OLS",24,"--","--","--","--","--",65.885859146084741,75.61,0.671671897683215,null,null,null,null,null,29,null,null,null,8,17,23,"X",null,23,23,"Southwest","QJUN0.8","A","P","-4.929","0.916","3.467"]
["QJUNMEAN=10-3.56A0.89P2.819","OLS",24,"--","--","--","--","--",45.858813208494141,84.28,0.69102903536336346,null,null,null,null,null,30,null,null,null,9,17,22,"X",null,22,22,"Southwest","QJUNMEAN","A","P","-3.56","0.89","2.819"]
["QJUL0.2=10-3.807A0.897P2.772","OLS",24,"--","--","--","--","--",46.555032272692976,84.26,0.70207362853122035,null,null,null,null,null,31,null,null,null,8,17,23,"X",null,23,23,"Southwest","QJUL0.2","A","P","-3.807","0.897","2.772"]
["QJUL0.5=10-4.422A0.898P3.002","OLS",24,"--","--","--","--","--",67.036005309998643,73.930000000000007,0.68691072397250819,null,null,null,null,null,32,null,null,null,8,17,23,"X",null,23,23,"Southwest","QJUL0.5","A","P","-4.422","0.898","3.002"]
["QJUL0.8=10-4.873A0.893P3.134","OLS",24,"--","--","--","--","--",96.959387105261143,61.28,0.67188949641681683,null,null,null,null,null,33,null,null,null,8,17,23,"X",null,23,23,"Southwest","QJUL0.8","A","P","-4.873","0.893","3.134"]
["QJULMEAN=10-3.982A0.893P2.791","OLS",24,"--","--","--","--","--",49.94236163139955,82.16,0.6958023394420777,null,null,null,null,null,34,null,null,null,9,18,24,"X",null,24,24,"Southwest","QJULMEAN","A","P","-3.982","0.893","2.791"]
["QAUG0.2=10-3.708A0.916P2.383","OLS",24,"--","--","--","--","--",78.199659280028229,69.400000000000006,0.74752195019968837,null,null,null,null,null,35,null,null,null,8,17,23,"X",null,23,23,"Southwest","QAUG0.2","A","P","-3.708","0.916","2.383"]
["QAUG0.5=10-4.599A0.963P2.78","OLS",24,"--","--","--","--","--",110.76416073180637,59.89,0.767422258070657,null,null,null,null,null,36,null,null,null,8,17,23,"X",null,23,23,"Southwest","QAUG0.5","A","P","-4.599","0.963","2.78"]
["QAUG0.8=10-5.612A0.98P3.304","OLS",24,"--","--","--","--","--",173.53096698481326,47.49,0.74686900191242978,null,null,null,null,null,37,null,null,null,8,17,22,"X",null,22,22,"Southwest","QAUG0.8","A","P","-5.612","0.98","3.304"]
["QAUGMEAN=10-4.015A0.924P2.49","OLS",24,"--","--","--","--","--",80.377890602804456,68.86,0.74893318849944923,null,null,null,null,null,38,null,null,null,9,18,24,"X",null,24,24,"Southwest","QAUGMEAN","A","P","-4.015","0.924","2.49"]
["QSEP0.2=10-3.754A0.946P2.321","OLS",24,"--","--","--","--","--",60.003328820844445,78.97,0.78206751610458725,null,null,null,null,null,39,null,null,null,8,17,23,"X",null,23,23,"Southwest","QSEP0.2","A","P","-3.754","0.946","2.321"]
["QSEP0.5=10-4.447A0.981P2.616","OLS",24,"--","--","--","--","--",89.516336146888392,67.8,0.79704779144695947,null,null,null,null,null,40,null,null,null,8,17,23,"X",null,23,23,"Southwest","QSEP0.5","A","P","-4.447","0.981","2.616"]
["QSEP0.8=10-5.3A1.028P3.011","OLS",24,"--","--","--","--","--",130.74843278927904,57.79,0.81554721477489289,null,null,null,null,null,41,null,null,null,8,15,21,"X",null,21,21,"Southwest","QSEP0.8","A","P","-5.3","1.028","3.011"]
["QSEPMEAN=10-3.949A0.95P2.363","OLS",24,"--","--","--","--","--",66.461895711315023,76.11,0.78304239564918021,null,null,null,null,null,42,null,null,null,9,18,23,"X",null,23,23,"Southwest","QSEPMEAN","A","P","-3.949","0.95","2.363"]
["QOCT0.2=10-3.207A0.986P1.907","OLS",23,"--","--","--","--","--",45.858813208494141,86.95,0.84351331438941124,null,null,null,null,null,43,null,null,null,8,17,23,"X",null,23,23,"Southwest","QOCT0.2","A","P","-3.207","0.986","1.907"]
["QOCT0.5=10-3.854A1.045P2.162","OLS",23,"--","--","--","--","--",60.003328820844445,82.02,0.88353989637721742,null,null,null,null,null,44,null,null,null,8,17,23,"X",null,23,23,"Southwest","QOCT0.5","A","P","-3.854","1.045","2.162"]
["QOCT0.8=10-4.555A1.115P2.427","OLS",23,"--","--","--","--","--",83.083143179119261,75.14,0.93356591086923635,null,null,null,null,null,45,null,null,null,8,17,23,"X",null,23,23,"Southwest","QOCT0.8","A","P","-4.555","1.115","2.427"]
["QOCTMEAN=10-3.494A1.005P1.999","OLS",23,"--","--","--","--","--",47.244611829214058,86.51,0.85561712591153627,null,null,null,null,null,46,null,null,null,9,18,24,"X",null,24,24,"Southwest","QOCTMEAN","A","P","-3.494","1.005","1.999"]
["QNOV0.2=10-3.224A1.096P1.723","OLS",20,"--","--","--","--","--",44.445124250513942,88.73,0.97509157232683097,null,null,null,null,null,47,null,null,null,8,17,23,"X",null,23,23,"Southwest","QNOV0.2","A","P","-3.224","1.096","1.723"]
["QNOV0.5=10-3.626A1.164P1.804","OLS",20,"--","--","--","--","--",58.795779438743267,84.38,1.0372360101602156,null,null,null,null,null,48,null,null,null,8,17,23,"X",null,23,23,"Southwest","QNOV0.5","A","P","-3.626","1.164","1.804"]
["QNOV0.8=10-4.133A1.242P1.935","OLS",20,"--","--","--","--","--",73.241147225708787,81.069999999999993,1.1062682372147135,null,null,null,null,null,49,null,null,null,8,17,23,"X",null,23,23,"Southwest","QNOV0.8","A","P","-4.133","1.242","1.935"]
["QNOVMEAN=10-3.43A1.122P1.75","OLS",20,"--","--","--","--","--",45.858813208494141,88.63,0.99942402855095469,null,null,null,null,null,50,null,null,null,9,17,23,"X",null,23,23,"Southwest","QNOVMEAN","A","P","-3.43","1.122","1.75"]
["QDEC0.2=10-1.957A1.118(SLP50 + 1)0.932","OLS",15,"--","--","--","--","--",37.647729371743736,92.53,0.95281551293381705,null,null,null,null,null,51,null,null,null,8,17,"X",24,null,23,33,"Southwest","QDEC0.2","A","SLP50","-1.957","1.118","0.932"]
["QDEC0.5=10-2.585A1.226(SLP50 + 1)1.182","OLS",15,"--","--","--","--","--",49.94236163139955,89.76,1.0164290050048717,null,null,null,null,null,52,null,null,null,8,17,"X",24,null,23,33,"Southwest","QDEC0.5","A","SLP50","-2.585","1.226","1.182"]
["QDEC0.8=10-3.107A1.332(SLP50 + 1)1.328","OLS",15,"--","--","--","--","--",66.461895711315023,86.22,1.0963704576349089,null,null,null,null,null,53,null,null,null,8,17,"X",24,null,23,33,"Southwest","QDEC0.8","A","SLP50","-3.107","1.332","1.328"]
["QDECMEAN=10-2.247A1.16(SLP50 + 1)1.03","OLS",15,"--","--","--","--","--",40.768554789241762,91.85,0.97711321171702115,null,null,null,null,null,54,null,null,null,9,18,"X",24,null,23,33,"Southwest","QDECMEAN","A","SLP50","-2.247","1.16","1.03"]
["1The number of gaging stations used for each flow characteristic varies based on data availability. Some streamflow gaging stations were operated on a seasonal basis only."]
["2Regression coefficients for ordinary least squares (OLS) regressions relating streamflow characteristic to contributing drainage area for use with ungaged sites on gaged streams."]

{"sheet":"Flood Q Regression Tool","index":4,"n_rows":46,"n_cols":91,"rows_kept":46,"cut":false,"hidden":false,"merged":[[37,76,37,77],[27,76,27,77],[17,76,17,77],[6,76,6,77],[2,68,2,74],[3,71,3,74],[19,17,20,19],[8,2,10,2],[8,3,10,10],[7,3,7,10],[1,1,3,15],[4,1,5,10],[6,3,6,8],[4,12,5,20],[17,12,18,20],[6,18,7,20],[8,18,8,20],[10,18,10,20],[8,12,8,14],[10,12,10,14],[12,12,12,14],[12,18,12,20],[26,3,26,9],[14,3,16,10],[14,2,16,2],[0,80,0,81],[11,2,13,2],[11,3,13,10],[0,26,0,28],[0,39,0,41],[0,52,0,54],[0,64,0,66],[2,43,2,50],[3,46,3,50],[2,56,2,62],[3,59,3,62],[2,30,2,37],[3,33,3,37]]}
[null,"Flood Q Regression Tool.  Use to estimate flood discharge in Washington State at ungaged sites based on regional regression equations and user-determined basin characteristics.",null,null,null,null,null,null,null,null,null,null,null,null,null,null,null,null,null,null,null,null,null,null,null,null,"REGION 1 Calcs",null,null,null,null,null,null,null,null,null,null,null,null,"REGION 2 Calcs",null,null,null,null,null,null,null,null,null,null,null,null,"REGION 3 Calcs",null,null,null,null,null,null,null,null,null,null,null,"REGION 4 Calcs",null,null,null,null,null,null,null,null,null,null,null,"List Box",null,null,null,"Valid ranges"]
[null,"DA = Drainage Area, in square miles; P = Average Basin Annual Precipitation, in inches (from PRISM data set, years 1981-2010); CAN = Percent canopy cover (NLCD 2001); AEP = Annual Exceedance Probability; Qu = Flood Discharge, in cubic feet per second at ungaged site for the indicated AEP;                    PIL, PIU= Predition Intervals (L=Lower and U=Upper)",null,null,null,null,null,null,null,null,null,null,null,null,null,null,null,null,null,null,null,null,null,null,null,null,"XT=",1,null,null,null,null,null,null,null,null,null,null,null,"XT=",1,null,null,null,null,null,null,null,null,null,null,null,"XT=",1,null,null,null,null,null,null,null,null,null,null,"XT=",1,null,null,null,null,null,null,null,null,null,null,null,"Regression Region 1",null,null,0.25,3304,9.82,52.45,0,77.400000000000006]
[null,null,null,null,null,null,null,null,null,null,null,null,null,null,null,null,null,null,null,null,null,null,null,null,null,null,null,{"$f":"LOG10($Q$9)","v":1.3010299956639813},null,null,"REGION 1",null,null,null,null,null,null,null,null,null,{"$f":"LOG10($Q$9)","v":1.3010299956639813},null,null,"REGION 2",null,null,null,null,null,null,null,null,null,{"$f":"LOG10($Q$9)","v":1.3010299956639813},null,null,"REGION 3",null,null,null,null,null,null,null,null,{"$f":"LOG10($Q$9)","v":1.3010299956639813},null,null,"REGION 4",null,null,null,null,null,null,null,1,"Regression Region 2",null,null,0.42,1820,8.86,84.2,0,81.8]
[null,null,null,null,null,null,null,null,null,null,null,null,null,null,null,null,null,null,null,null,null,null,null,null,null,null,null,{"$f":"$Q$11","v":10},null,null,null,null,null,"(XTΛ-1X)-1",null,null,null,null,null,null,{"$f":"$Q$11","v":10},null,null,null,null,null,"(XTΛ-1X)-1",null,null,null,null,null,null,{"$f":"LOG10($Q$11)","v":1},null,null,null,null,null,"(XTΛ-1X)-1",null,null,null,null,null,{"$f":"$Q$11","v":10},null,null,null,null,null,"(XTΛ-1X)-1",null,null,null,null,null,"Regression Region 3",null,null,0.08,2605,33.29,168]
[null,"Instructions for using the Flood Q Tool to estimate Flood Discharges at Ungaged Sites using the regional regression equations ",null,null,null,null,null,null,null,null,null,null,"User determined basin characteristics for ungaged site",null,null,null,null,null,null,null,null,null,null,null,null,null,null,{"$f":"$Q$13","v":20},null,null,"AEP","σ2δ","t(α/2, n-p)",null,"Intercept","DA","MAP","CAN",null,null,{"$f":"$Q$13","v":20},null,null,"AEP","σ2δ","t(α/2, n-p)",null,"Intercept","DA","MAP","CAN",null,null,null,null,null,"AEP","σ2δ","t(α/2, n-p)",null,"Intercept","DA","MAP",null,null,null,null,null,"AEP","σ2δ","t(α/2, n-p)",null,"Intercept","DA","MAP",null,null,"Regression Region 4",null,null,0.18,2230,11.94,186.6]
[null,null,null,null,null,null,null,null,null,null,null,null,null,null,null,null,null,null,null,null,null,null,null,null,null,null,"AEP=0.5",null,{"$f":"MMULT(MMULT(TRANSPOSE(AB2:AB5),AI6:AL9),AB2:AB5)","v":1.1305230278340269E-2},null,0.5,0.113,1.6621999999999999,"Intercept",1.9164021999999999E-2,-2.3091142999999998E-3,-6.5479901999999999E-4,1.9232440000000001E-4,null,"AEP=0.5",null,{"$f":"MMULT(MMULT(TRANSPOSE(AO2:AO5),AV6:AY9),AO2:AO5)","v":6.7634246290829859E-3},null,0.5,8.2000000000000003E-2,1.663,"Intercept",1.6351936000000001E-2,-2.4383898999999999E-3,-1.2665307999999999E-4,-1.1532899000000001E-4,null,"AEP=0.5",null,{"$f":"MMULT(MMULT(TRANSPOSE(BB$2:BB$4),BI6:BK8),BB$2:BB$4)","v":9.9131680928132831E-3},null,0.5,3.1E-2,1.6558999999999999,"Intercept",3.9759999999999997E-2,9.1349999999999998E-5,-2.0310000000000002E-2,null,"AEP=0.5",null,{"$f":"MMULT(MMULT(TRANSPOSE(BN$2:BN$4),BU6:BW8),BN$2:BN$4)","v":5.6993483117523099E-4},null,0.5,4.4999999999999998E-2,1.6560999999999999,"Intercept",4.633E-3,-5.756E-4,-3.3139999999999998E-4,null,null,null,null,null,null,null,null,null,null,null,null,1.8162872E-2,-2.6915895E-3,-1.3791035E-3,-1.2607548000000001E-3]
[null,null,"Steps","Instructions",null,null,null,null,null,null,null,null,null,"Selected Region:",null,{"$f":"INDEX(BZ2:BZ5,BY3)","v":"Regression Region 1"},null,null,"Range of values that are valid for the regression",null,null,null,null,null,null,null,null,"Si =",{"$f":"SQRT(AF6 + AC6)","v":0.35256946872685996},null,null,null,null,"DA",-2.3091142999999998E-3,1.6150022E-3,7.9102264000000001E-6,-1.5452191999999999E-5,null,null,"Si =",{"$f":"SQRT(AS6 + AP6)","v":0.29793191274028197},null,null,null,null,"DA",-2.4383898999999999E-3,1.5462302000000001E-3,1.062816E-6,5.2388638000000001E-7,null,null,"Si =",{"$f":"SQRT(BF6 + BC6)","v":0.20227003755577166},null,null,null,null,"DA",9.1349999999999998E-5,4.0640000000000001E-4,-3.2759999999999999E-4,null,null,"Si =",{"$f":"SQRT(BR6 + BO6)","v":0.21347115690691151},null,null,null,null,"DA",-5.756E-4,4.3839999999999998E-4,1.945E-6,null,"Region 1",null,null,"Q = aAb10cP/10dCAN",null,null,null,null,"Range",null,null,-2.6915895E-3,1.5892354E-3,2.6963556E-5,1.9480044E-5]
[null,null,1,"Select the Regression Region below from the List Box",null,null,null,null,null,null,null,null,null,null,null,null,null,null,null,null,null,null,null,null,null,null,null,"T =",{"$f":"POWER(10,(AG6*AC7))","v":3.8551472503342001},null,null,null,null,"MAP",-6.5479901999999999E-4,7.9102264000000001E-6,4.0330544000000003E-5,-1.6590843000000001E-5,null,null,"T =",{"$f":"POWER(10,(AT6*AP7))","v":3.1293977853936554},null,null,null,null,"MAP",-1.2665307999999999E-4,1.062816E-6,5.5352865999999999E-6,-1.6684268E-6,null,null,"T =",{"$f":"POWER(10,(BG6*BC7))","v":2.16241455148766},null,null,null,null,"MAP",-2.0310000000000002E-2,-3.2759999999999999E-4,1.0699999999999999E-2,null,null,"T =",{"$f":"POWER(10,(BS6*BO7))","v":2.256989730235091},null,null,null,null,"MAP",-3.3139999999999998E-4,1.945E-6,3.2700000000000002E-5,null,"AEP","rounded",null,"a","b","c","d",null,"0.25 - 3304",null,null,-1.3791035E-3,2.6963556E-5,5.5899623999999999E-4,-1.5887111000000001E-4]
[null,null,2,"Determine the drainage area, DA and the Annual Precipitation, P for the ungage drainage basin.  If you pick Regression Region 1 or 2, determine the percent canopy cover, CAN.  ",null,null,null,null,null,null,null,null,"Drainage Area, DA",null,null,"=",20,"square miles",{"$f":"IF(BY3=1,CG8,IF(BY3=2,CG18,IF(BY3=3,CG28,IF(BY3=4,CG38))))","v":"0.25 - 3304"},null,null,null,null,null,null,null,null,null,null,null,null,null,null,"CAN",1.9232440000000001E-4,-1.5452191999999999E-5,-1.6590843000000001E-5,1.0051477000000001E-5,null,null,null,null,null,null,null,null,"CAN",-1.1532899000000001E-4,5.2388638000000001E-7,-1.6684268E-6,3.3604961000000001E-6,null,null,null,null,null,null,null,null,null,null,null,null,null,null,null,null,null,null,null,null,null,null,null,null,null,0.5,{"$f":"IF(CA9<100,ROUND(CA9,1),IF(CA9<1000,ROUND(CA9,0),IF(CA9<10000,ROUND(CA9,-1),IF(CA9<100000,ROUND(CA9,-2),IF(CA9>100000,ROUND(CA9,-3),\"\")))))","v":52.3},{"$f":"CB9*(POWER($Q$9,CC9))*(POWER(10,(CD9*$Q$11)))/(POWER(10,(CE9*$Q$13)))","v":52.272903861607745},3.8460000000000001,0.745,3.2000000000000001E-2,7.7999999999999996E-3,null,"9.82 - 52.45",null,null,-1.2607548000000001E-3,1.9480044E-5,-1.5887111000000001E-4,3.4076665E-4]
[null,null,null,null,null,null,null,null,null,null,null,null,null,null,null,null,null,null,null,null,null,null,null,null,null,null,"AEP=0.2",null,{"$f":"MMULT(MMULT(TRANSPOSE(AB$2:AB$5),AI10:AL13),AB$2:AB$5)","v":8.5602970383059206E-3},null,0.2,7.1999999999999995E-2,1.6621999999999999,"Intercept",1.5232580000000001E-2,-1.9370546999999999E-3,-4.6810744000000003E-4,1.2497027E-4,null,"AEP=0.2",null,{"$f":"MMULT(MMULT(TRANSPOSE(AO$2:AO$5),AV10:AY13),AO$2:AO$5)","v":6.3694034263399556E-3},null,0.2,6.8000000000000005E-2,1.663,"Intercept",1.541056E-2,-2.3101859000000001E-3,-1.148421E-4,-1.0719225E-4,null,"AEP=0.2",null,{"$f":"MMULT(MMULT(TRANSPOSE(BB$2:BB$4),BI10:BK12),BB$2:BB$4)","v":1.1026178568694863E-2},null,0.2,3.3000000000000002E-2,1.6558999999999999,"Intercept",4.4049999999999999E-2,7.1190000000000001E-5,-2.2409999999999999E-2,null,"AEP=0.2",null,{"$f":"MMULT(MMULT(TRANSPOSE(BN$2:BN$4),BU10:BW12),BN$2:BN$4)","v":6.0095500715700505E-4},null,0.2,4.2000000000000003E-2,1.6560999999999999,"Intercept",4.6940000000000003E-3,-5.5509999999999999E-4,-3.3159999999999998E-4,null,0.2,{"$f":"IF(CA10<100,ROUND(CA10,1),IF(CA10<1000,ROUND(CA10,0),IF(CA10<10000,ROUND(CA10,-1),IF(CA10<100000,ROUND(CA10,-2),IF(CA10>100000,ROUND(CA10,-3),\"\")))))","v":124},{"$f":"CB10*(POWER($Q$9,CC10))*(POWER(10,(CD10*$Q$11)))/(POWER(10,(CE10*$Q$13)))","v":124.34692686147282},12.106,0.71299999999999997,2.8000000000000001E-2,9.7999999999999997E-3,null,"0.0 - 77.4"]
[null,null,null,null,null,null,null,null,null,null,null,null,"Annual Precipitation, P",null,null,"=",10,"inches",{"$f":"IF(BY3=1,CG9,IF(BY3=2,CG19,IF(BY3=3,CG29,IF(BY3=4,CG39))))","v":"9.82 - 52.45"},null,null,null,null,null,null,null,null,"Si =",{"$f":"SQRT(AF10 + AC10)","v":0.28383145885948924},null,null,null,null,"DA",-1.9370546999999999E-3,1.1528013000000001E-3,8.3809380000000003E-6,-8.7630098999999997E-6,null,null,"Si =",{"$f":"SQRT(AS10 + AP10)","v":0.27270754193153507},null,null,null,null,"DA",-2.3101859000000001E-3,1.3865811E-3,2.1568122E-6,7.5997966000000004E-7,null,null,"Si =",{"$f":"SQRT(BF10 + BC10)","v":0.20982416106991794},null,null,null,null,"DA",7.1190000000000001E-5,4.3459999999999999E-4,-3.4000000000000002E-4,null,null,"Si =",{"$f":"SQRT(BR10 + BO10)","v":0.20639998790493425},null,null,null,null,"DA",-5.5509999999999999E-4,4.2099999999999999E-4,1.6810000000000001E-6,null,0.1,{"$f":"IF(CA11<100,ROUND(CA11,1),IF(CA11<1000,ROUND(CA11,0),IF(CA11<10000,ROUND(CA11,-1),IF(CA11<100000,ROUND(CA11,-2),IF(CA11>100000,ROUND(CA11,-3),\"\")))))","v":197},{"$f":"$CB11*(POWER($Q$9,$CC11))*(POWER(10,($CD11*$Q$11)))/(POWER(10,($CE11*$Q$13)))","v":196.88603637896682},22.08,0.69499999999999995,2.5999999999999999E-2,1.0699999999999999E-2]
[null,null,3,"Enter these basin characteristic values in the green-shade cells.  If the cell changes to red, than the value is outside the range of valid values for this regression.  Valid value range listed to the right of the green cells.",null,null,null,null,null,null,null,null,null,null,null,null,null,null,null,null,null,null,null,null,null,null,null,"T =",{"$f":"POWER(10,(AG10*AC11))","v":2.9633616138782597},null,null,null,null,"MAP",-4.6810744000000003E-4,8.3809380000000003E-6,2.8210214000000001E-5,-1.1574344000000001E-5,null,null,"T =",{"$f":"POWER(10,(AT10*AP11))","v":2.8412708926502654},null,null,null,null,"MAP",-1.148421E-4,2.1568122E-6,4.8094590999999997E-6,-1.4492182E-6,null,null,"T =",{"$f":"POWER(10,(BG10*BC11))","v":2.2256036675376389},null,null,null,null,"MAP",-2.2409999999999999E-2,-3.4000000000000002E-4,1.176E-2,null,null,"T =",{"$f":"POWER(10,(BS10*BO11))","v":2.1969441672078029},null,null,null,null,"MAP",-3.3159999999999998E-4,1.6810000000000001E-6,3.2270000000000001E-5,null,0.04,322,322.031101919435,42.17,0.67400000000000004,2.4E-2,1.17E-2]
[null,null,null,null,null,null,null,null,null,null,null,null,"Percent Canopy, CAN",null,null,"=",20,"%",{"$f":"IF(BY3=1,CG10,IF(BY3=2,CG20,\"value not used in regression\"))","v":"0.0 - 77.4"},null,null,null,null,null,null,null,null,null,null,null,null,null,null,"CAN",1.2497027E-4,-8.7630098999999997E-6,-1.1574344000000001E-5,7.0668541999999999E-6,null,null,null,null,null,null,null,null,"CAN",-1.0719225E-4,7.5997966000000004E-7,-1.4492182E-6,3.0266263000000001E-6,null,null,null,null,null,null,null,null,null,null,null,null,null,null,null,null,null,null,null,null,null,null,null,null,null,0.02,444,443.58663742360528,63.826000000000001,0.66100000000000003,2.3E-2,1.24E-2]
[null,null,null,null,null,null,null,null,null,null,null,null,null,null,null,null,null,null,null,null,null,null,null,null,null,null,"AEP=0.1",null,{"$f":"MMULT(MMULT(TRANSPOSE(AB$2:AB$5),AI14:AL17),AB$2:AB$5)","v":8.8162726480951609E-3},null,0.1,7.0000000000000007E-2,1.6621999999999999,"Intercept",1.5791970999999998E-2,-2.0214732999999999E-3,-4.7930820000000003E-4,1.2646694E-4,null,"AEP=0.1",null,{"$f":"MMULT(MMULT(TRANSPOSE(AO$2:AO$5),AV14:AY17),AO$2:AO$5)","v":7.0905431476548184E-3},null,0.1,7.2999999999999995E-2,1.663,"Intercept",1.7136180000000001E-2,-2.5562481000000001E-3,-1.2648398999999999E-4,-1.1984721999999999E-4,null,"AEP=0.1",null,{"$f":"MMULT(MMULT(TRANSPOSE(BB$2:BB$4),BI14:BK16),BB$2:BB$4)","v":1.221329828714404E-2},null,0.1,3.4000000000000002E-2,1.6558999999999999,"Intercept",4.8710000000000003E-2,7.8150000000000002E-5,-2.4750000000000001E-2,null,"AEP=0.1",null,{"$f":"MMULT(MMULT(TRANSPOSE(BN$2:BN$4),BU14:BW16),BN$2:BN$4)","v":6.4912044490833315E-4},null,0.1,4.1000000000000002E-2,1.6560999999999999,"Intercept",4.9760000000000004E-3,-5.6789999999999998E-4,-3.4919999999999998E-4,null,0.01,589,589.34462204887143,92.47,0.64900000000000002,2.1999999999999999E-2,1.2999999999999999E-2]
[null,null,4,"Rows 23-30 will have the results.  Estimated flood discharge, Qu, will be found in column O and the  90% prediction limits for these flood discharges will be found in columns R and T. ",null,null,null,null,null,null,null,null,null,null,null,null,null,null,null,null,null,null,null,null,null,null,null,"Si =",{"$f":"SQRT(AF14 + AC14)","v":0.28074235991046159},null,null,null,null,"DA",-2.0214732999999999E-3,1.1669536999999999E-3,9.3706662000000001E-6,-8.5581334000000003E-6,null,null,"Si =",{"$f":"SQRT(AS14 + AP14)","v":0.28300272639615121},null,null,null,null,"DA",-2.5562481000000001E-3,1.5328161E-3,2.7589292E-6,3.6609290999999999E-7,null,null,"Si =",{"$f":"SQRT(BF14 + BC14)","v":0.21497278499183112},null,null,null,null,"DA",7.8150000000000002E-5,4.6969999999999998E-4,-3.7090000000000002E-4,null,null,"Si =",{"$f":"SQRT(BR14 + BO14)","v":0.20408116141601199},null,null,null,null,"DA",-5.6789999999999998E-4,4.2959999999999998E-4,1.5239999999999999E-6,null,5.0000000000000001E-3,756,756.41041973370852,129.41999999999999,0.63700000000000001,2.1000000000000001E-2,1.3599999999999999E-2]
[null,null,null,null,null,null,null,null,null,null,null,null,null,null,null,null,null,null,null,null,null,null,null,null,null,null,null,"T =",{"$f":"POWER(10,(AG14*AC15))","v":2.9285318430704765},null,null,null,null,"MAP",-4.7930820000000003E-4,9.3706662000000001E-6,2.8879587000000002E-5,-1.1906701999999999E-5,null,null,"T =",{"$f":"POWER(10,(AT14*AP15))","v":2.9555174917702085},null,null,null,null,"MAP",-1.2648398999999999E-4,2.7589292E-6,5.2784384999999996E-6,-1.6135141999999999E-6,null,null,"T =",{"$f":"POWER(10,(BG14*BC15))","v":2.2697260109089492},null,null,null,null,"MAP",-2.4750000000000001E-2,-3.7090000000000002E-4,1.2970000000000001E-2,null,null,"T =",{"$f":"POWER(10,(BS14*BO15))","v":2.177603527738611},null,null,null,null,"MAP",-3.4919999999999998E-4,1.5239999999999999E-6,3.3680000000000003E-5,null,2E-3,1030,1027.6609151002169,193.2,0.624,0.02,1.43E-2]
[null,null,null,null,null,null,null,null,null,null,null,null,null,"Selected Region:",null,{"$f":"INDEX(BZ2:BZ5,BY3)","v":"Regression Region 1"},null,null,null,null,null,null,null,null,null,null,null,null,null,null,null,null,null,"CAN",1.2646694E-4,-8.5581334000000003E-6,-1.1906701999999999E-5,7.2819301E-6,null,null,null,null,null,null,null,null,"CAN",-1.1984721999999999E-4,3.6609290999999999E-7,-1.6135141999999999E-6,3.4039947000000002E-6]
[null,null,null,null,null,null,null,null,null,null,null,null,{"$f":"\"Estimate of indicated flood discharge for \"&INDEX(BZ2:BZ5,BY3) &\" \" &CHAR(10) &\" using regional regression equations\"","v":"Estimate of indicated flood discharge for Regression Region 1 \n using regional regression equations"},null,null,null,null,null,null,null,null,null,null,null,null,null,"AEP=0.04",null,{"$f":"MMULT(MMULT(TRANSPOSE(AB$2:AB$5),AI18:AL21),AB$2:AB$5)","v":1.0461466766322966E-2},null,0.04,8.1000000000000003E-2,1.6621999999999999,"Intercept",1.8674052999999999E-2,-2.3865849000000001E-3,-5.7336246000000001E-4,1.5357323999999999E-4,null,"AEP=0.04",null,{"$f":"MMULT(MMULT(TRANSPOSE(AO$2:AO$5),AV18:AY21),AO$2:AO$5)","v":8.5659300939136991E-3},null,0.04,8.7999999999999995E-2,1.663,"Intercept",2.0677082999999999E-2,-3.0757235E-3,-1.5233755E-4,-1.4575708E-4,null,"AEP=0.04",null,{"$f":"MMULT(MMULT(TRANSPOSE(BB$2:BB$4),BI18:BK20),BB$2:BB$4)","v":1.4139923722536604E-2},null,0.04,3.7999999999999999E-2,1.6558999999999999,"Intercept",5.6390000000000003E-2,1.106E-4,-2.8670000000000001E-2,null,"AEP=0.04",null,{"$f":"MMULT(MMULT(TRANSPOSE(BN$2:BN$4),BU18:BW20),BN$2:BN$4)","v":7.2932716407921928E-4},null,0.04,4.2999999999999997E-2,1.6560999999999999,"Intercept",5.5310000000000003E-3,-6.0979999999999997E-4,-3.8640000000000001E-4,null,"Region 2",null,null,"Q =aAb10cP/10dCAN",null,null,null,null,"0.42 - 1820"]
[null,null,null,null,null,null,null,null,null,null,null,null,null,null,null,null,null,null,null,null,null,null,null,null,null,null,null,"Si =",{"$f":"SQRT(AF18 + AC18)","v":0.30242596906734542},null,null,null,null,"DA",-2.3865849000000001E-3,1.3790186000000001E-3,1.1691159E-5,-1.0558821E-5,null,null,"Si =",{"$f":"SQRT(AS18 + AP18)","v":0.31075059146188877},null,null,null,null,"DA",-3.0757235E-3,1.8769037000000001E-3,3.4404480000000002E-6,-5.5064938000000005E-7,null,null,"Si =",{"$f":"SQRT(BF18 + BC18)","v":0.22834168196484977},null,null,null,null,"DA",1.106E-4,5.3269999999999999E-4,-4.3409999999999998E-4,null,null,"Si =",{"$f":"SQRT(BR18 + BO18)","v":0.209115583264565},null,null,null,null,"DA",-6.0979999999999997E-4,4.616E-4,1.296E-6,null,0.5,{"$f":"IF(CA19<100,ROUND(CA19,1),IF(CA19<1000,ROUND(CA19,0),IF(CA19<10000,ROUND(CA19,-1),IF(CA19<100000,ROUND(CA19,-2),IF(CA19>100000,ROUND(CA19,-3),\"\")))))","v":32.6},{"$f":"$CB19*(POWER($Q$9,$CC19))*(POWER(10,($CD19*$Q$11)))/(POWER(10,($CE19*$Q$13)))","v":32.649095429801747},1.4450000000000001,0.877,2.53E-2,2E-3,null,"8.86 - 84.20"]
[null,null,null,null,null,null,null,null,null,null,null,null,null,null,null,null,null,"Prediction Intervals, 90% confidence level",null,null,null,null,null,null,null,null,null,"T =",{"$f":"POWER(10,(AG18*AC19))","v":3.1819433676076985},null,null,null,null,"MAP",-5.7336246000000001E-4,1.1691159E-5,3.4677961000000002E-5,-1.4379117000000001E-5,null,null,"T =",{"$f":"POWER(10,(AT18*AP19))","v":3.2868375025981402},null,null,null,null,"MAP",-1.5233755E-4,3.4404480000000002E-6,6.4587144000000002E-6,-2.0265267999999998E-6,null,null,"T =",{"$f":"POWER(10,(BG18*BC19))","v":2.3884216057179399},null,null,null,null,"MAP",-2.8670000000000001E-2,-4.3409999999999998E-4,1.503E-2,null,null,"T =",{"$f":"POWER(10,(BS18*BO19))","v":2.2198126268630598},null,null,null,null,"MAP",-3.8640000000000001E-4,1.296E-6,3.6980000000000002E-5,null,0.2,93.7,{"$f":"$CB20*(POWER($Q$9,$CC20))*(POWER(10,($CD20*$Q$11)))/(POWER(10,($CE20*$Q$13)))","v":93.736999552479816},5.7679999999999998,0.86,2.1399999999999999E-2,6.1000000000000004E-3,null,"0.0 - 81.8"]
[null,null,null,null,null,null,null,null,null,null,null,null,null,null,null,null,null,null,null,null,null,null,null,null,null,null,null,null,null,null,null,null,null,"CAN",1.5357323999999999E-4,-1.0558821E-5,-1.4379117000000001E-5,8.7916700000000005E-6,null,null,null,null,null,null,null,null,"CAN",-1.4575708E-4,-5.5064938000000005E-7,-2.0265267999999998E-6,4.2399400000000001E-6,null,null,null,null,null,null,null,null,null,null,null,null,null,null,null,null,null,null,null,null,null,null,null,null,null,0.1,164,164.04880679526653,12.106,0.84699999999999998,1.9400000000000001E-2,8.2000000000000007E-3]
[null,null,null,null,null,null,null,null,null,null,null,null,"AEP",null,"*Qu, ft3/s",null,null,"PIL, in ft3/s",null,"PIU, in ft3/s",null,null,null,null,null,null,"AEP=0.02",null,{"$f":"MMULT(MMULT(TRANSPOSE(AB$2:AB$5),AI22:AL25),AB$2:AB$5)","v":1.2092169722124351E-2},null,0.02,9.2999999999999999E-2,1.6621999999999999,"Intercept",2.1489199E-2,-2.7392687999999998E-3,-6.6794602999999998E-4,1.8161996000000001E-4,null,"AEP=0.02",null,{"$f":"MMULT(MMULT(TRANSPOSE(AO$2:AO$5),AV22:AY25),AO$2:AO$5)","v":9.8243651678435844E-3},null,0.02,0.10199999999999999,1.663,"Intercept",2.3696788E-2,-3.5226114999999999E-3,-1.7469986000000001E-4,-1.6777786000000001E-4,null,"AEP=0.02",null,{"$f":"MMULT(MMULT(TRANSPOSE(BB$2:BB$4),BI22:BK24),BB$2:BB$4)","v":1.5880441565011894E-2},null,0.02,4.1000000000000002E-2,1.6558999999999999,"Intercept",6.3299999999999995E-2,1.3630000000000001E-4,-3.2190000000000003E-2,null,"AEP=0.02",null,{"$f":"MMULT(MMULT(TRANSPOSE(BN$2:BN$4),BU22:BW24),BN$2:BN$4)","v":7.9707525001226226E-4},null,0.02,4.4999999999999998E-2,1.6560999999999999,"Intercept",5.9979999999999999E-3,-6.4820000000000003E-4,-4.1800000000000002E-4,null,0.04,296,295.63643980703762,26.484999999999999,0.83299999999999996,1.7399999999999999E-2,1.0500000000000001E-2]
[null,null,null,null,null,null,null,null,null,null,null,null,0.5,"=",{"$f":"IF($BY$3=1,BZ9,IF($BY$3=2,BZ19,IF($BY$3=3,BZ29,IF($BY$3=4,BZ39,\"error\"))))","v":52.3},null,null,{"$f":"IF($BY$3=1,O23/AC8,IF($BY$3=2,O23/AP8,IF($BY$3=3,O23/BC8,IF($BY$3=4,O23/BO8,\"error\"))))","v":13.566278174060963},null,{"$f":"IF($BY$3=1,O23*AC8,IF($BY$3=2,O23*AP8,IF($BY$3=3,O23*BC8,IF($BY$3=4,O23*BO8,\"error\"))))","v":201.62420119247867},null,null,null,null,null,null,null,"Si =",{"$f":"SQRT(AF22 + AC22)","v":0.3241792246923364},null,null,null,null,"DA",-2.7392687999999998E-3,1.5956811999999999E-3,1.3873149999999999E-5,-1.2797498E-5,null,null,"Si =",{"$f":"SQRT(AS22 + AP22)","v":0.33440150293897242},null,null,null,null,"DA",-3.5226114999999999E-3,2.1799603E-3,3.9471253999999997E-6,-1.4054492000000001E-6,null,null,"Si =",{"$f":"SQRT(BF22 + BC22)","v":0.23849620870154706},null,null,null,null,"DA",1.3630000000000001E-4,5.9139999999999996E-4,-4.9010000000000004E-4,null,null,"Si =",{"$f":"SQRT(BR22 + BO22)","v":0.21400251225163749},null,null,null,null,"DA",-6.4820000000000003E-4,4.9149999999999997E-4,1.1060000000000001E-6,null,0.02,433,433.2584038321753,43.853000000000002,0.82299999999999995,1.6199999999999999E-2,1.1900000000000001E-2]
[null,null,null,null,null,null,null,null,null,null,null,null,0.2,"=",{"$f":"IF($BY$3=1,BZ10,IF($BY$3=2,BZ20,IF($BY$3=3,BZ30,IF($BY$3=4,BZ40,\"error\"))))","v":124},null,null,{"$f":"IF($BY$3=1,O24/AC12,IF($BY$3=2,O24/AP12,IF($BY$3=3,O24/BC12,IF($BY$3=4,O24/BO12,\"error\"))))","v":41.84437006245642},null,{"$f":"IF($BY$3=1,O24*AC12,IF($BY$3=2,O24*AP12,IF($BY$3=3,O24*BC12,IF($BY$3=4,O24*BO12,\"error\"))))","v":367.45684012090419},null,null,null,null,null,null,null,"T =",{"$f":"POWER(10,(AG22*AC23))","v":3.4582047842569019},null,null,null,null,"MAP",-6.6794602999999998E-4,1.3873149999999999E-5,4.0493512000000001E-5,-1.6840003999999999E-5,null,null,"T =",{"$f":"POWER(10,(AT22*AP23))","v":3.5984021650002096},null,null,null,null,"MAP",-1.7469986000000001E-4,3.9471253999999997E-6,7.5084949999999998E-6,-2.3970999999999999E-6,null,null,"T =",{"$f":"POWER(10,(BG22*BC23))","v":2.4827093052752871},null,null,null,null,"MAP",-3.2190000000000003E-2,-4.9010000000000004E-4,1.6879999999999999E-2,null,null,"T =",{"$f":"POWER(10,(BS22*BO23))","v":2.2615675316101771},null,null,null,null,"MAP",-4.1800000000000002E-4,1.1060000000000001E-6,3.985E-5,null,0.01,605,605.39599019897184,68.549000000000007,0.81399999999999995,1.5100000000000001E-2,1.32E-2]
[null,null,null,null,null,null,null,null,null,null,null,null,0.1,"=",197,null,null,{"$f":"IF($BY$3=1,O25/AC16,IF($BY$3=2,O25/AP16,IF($BY$3=3,O25/BC16,IF($BY$3=4,O25/BO16,\"error\"))))","v":67.269201960751602},null,{"$f":"IF($BY$3=1,O25*AC16,IF($BY$3=2,O25*AP16,IF($BY$3=3,O25*BC16,IF($BY$3=4,O25*BO16,\"error\"))))","v":576.92077308488388},null,null,null,null,null,null,null,null,null,null,null,null,null,"CAN",1.8161996000000001E-4,-1.2797498E-5,-1.6840003999999999E-5,1.0288796E-5,null,null,null,null,null,null,null,null,"CAN",-1.6777786000000001E-4,-1.4054492000000001E-6,-2.3970999999999999E-6,4.9679682000000004E-6,null,null,null,null,null,null,null,null,null,null,null,null,null,null,null,null,null,null,null,null,null,null,null,null,null,5.0000000000000001E-3,822,821.54104760930056,103.514,0.80600000000000005,1.41E-2,1.4500000000000001E-2]
[null,null,null,null,null,null,null,null,null,null,null,null,0.04,"=",322,null,null,{"$f":"IF($BY$3=1,O26/AC20,IF($BY$3=2,O26/AP20,IF($BY$3=3,O26/BC20,IF($BY$3=4,O26/BO20,\"error\"))))","v":101.19601853319325},null,{"$f":"IF($BY$3=1,O26*AC20,IF($BY$3=2,O26*AP20,IF($BY$3=3,O26*BC20,IF($BY$3=4,O26*BO20,\"error\"))))","v":1024.5857643696788},null,null,null,null,null,null,"AEP=0.01",null,{"$f":"MMULT(MMULT(TRANSPOSE(AB$2:AB$5),AI26:AL29),AB$2:AB$5)","v":1.3968391318141253E-2},null,0.01,0.108,1.6621999999999999,"Intercept",2.4689019E-2,-3.1364397999999998E-3,-7.7821827000000001E-4,2.1513582000000001E-4,null,"AEP=0.01",null,{"$f":"MMULT(MMULT(TRANSPOSE(AO$2:AO$5),AV26:AY29),AO$2:AO$5)","v":1.1074518218201466E-2},null,0.01,0.11600000000000001,1.663,"Intercept",2.6692724000000001E-2,-3.9644286000000001E-3,-1.9677533000000001E-4,-1.8965478000000001E-4,null,"AEP=0.01",null,{"$f":"MMULT(MMULT(TRANSPOSE(BB$2:BB$4),BI26:BK28),BB$2:BB$4)","v":1.7110689651693805E-2},null,0.01,4.2999999999999997E-2,1.6558999999999999,"Intercept",6.8260000000000001E-2,1.4689999999999999E-4,-3.4709999999999998E-2,null,"AEP=0.01",null,{"$f":"MMULT(MMULT(TRANSPOSE(BN$2:BN$4),BU26:BW28),BN$2:BN$4)","v":8.625804893081302E-4},null,0.01,4.7E-2,1.6560999999999999,"Intercept",6.4669999999999997E-3,-6.8729999999999996E-4,-4.4979999999999998E-4,null,2E-3,1200,1195.6909509599573,169.82400000000001,0.79600000000000004,1.2999999999999999E-2,1.5900000000000001E-2]
[null,null,null,"Regression Regions in Washington State",null,null,null,null,null,null,null,null,0.02,"=",444,null,null,{"$f":"IF($BY$3=1,O27/AC24,IF($BY$3=2,O27/AP24,IF($BY$3=3,O27/BC24,IF($BY$3=4,O27/BO24,\"error\"))))","v":128.39031454159723},null,{"$f":"IF($BY$3=1,O27*AC24,IF($BY$3=2,O27*AP24,IF($BY$3=3,O27*BC24,IF($BY$3=4,O27*BO24,\"error\"))))","v":1535.4429242100643},null,null,null,null,null,null,null,"Si =",{"$f":"SQRT(AF26 + AC26)","v":0.34923973330384567},null,null,null,null,"DA",-3.1364397999999998E-3,1.8490997999999999E-3,1.634219E-5,-1.5602854E-5,null,null,"Si =",{"$f":"SQRT(AS26 + AP26)","v":0.35647512987332158},null,null,null,null,"DA",-3.9644286000000001E-3,2.4789637000000001E-3,4.4959957999999998E-6,-2.2814012999999999E-6,null,null,"Si =",{"$f":"SQRT(BF26 + BC26)","v":0.24517481447264072},null,null,null,null,"DA",1.4689999999999999E-4,6.3089999999999999E-4,-5.2630000000000005E-4,null,null,"Si =",{"$f":"SQRT(BR26 + BO26)","v":0.21877518252605374},null,null,null,null,"DA",-6.8729999999999996E-4,5.2209999999999995E-4,8.9270000000000005E-7]
[null,null,null,null,null,null,null,null,null,null,null,null,0.01,"=",589,null,null,{"$f":"IF($BY$3=1,O28/AC28,IF($BY$3=2,O28/AP28,IF($BY$3=3,O28/BC28,IF($BY$3=4,O28/BO28,\"error\"))))","v":154.74228660927213},null,{"$f":"IF($BY$3=1,O28*AC28,IF($BY$3=2,O28*AP28,IF($BY$3=3,O28*BC28,IF($BY$3=4,O28*BO28,\"error\"))))","v":2241.9275790849829},null,null,null,null,null,null,null,"T =",{"$f":"POWER(10,(AG26*AC27))","v":3.8063286571901234},null,null,null,null,"MAP",-7.7821827000000001E-4,1.634219E-5,4.7270154000000001E-5,-1.9699242000000001E-5,null,null,"T =",{"$f":"POWER(10,(AT26*AP27))","v":3.915778711554375},null,null,null,null,"MAP",-1.9677533000000001E-4,4.4959957999999998E-6,8.5429525999999994E-6,-2.7642321000000001E-6,null,null,"T =",{"$f":"POWER(10,(BG26*BC27))","v":2.5467421447739458},null,null,null,null,"MAP",-3.4709999999999998E-2,-5.2630000000000005E-4,1.8190000000000001E-2,null,null,"T =",{"$f":"POWER(10,(BS26*BO27))","v":2.3031041600337048},null,null,null,null,"MAP",-4.4979999999999998E-4,8.9270000000000005E-7,4.2729999999999999E-5,null,"Region 3",null,null,"Q=aAbPc",null,null,null,null,"0.08 - 2605"]
[null,null,null,null,null,null,null,null,null,null,null,null,5.0000000000000001E-3,"=",756,null,null,{"$f":"IF($BY$3=1,O29/AC32,IF($BY$3=2,O29/AP32,IF($BY$3=3,O29/BC32,IF($BY$3=4,O29/BO32,\"error\"))))","v":178.62181213219648},null,{"$f":"IF($BY$3=1,O29*AC32,IF($BY$3=2,O29*AP32,IF($BY$3=3,O29*BC32,IF($BY$3=4,O29*BO32,\"error\"))))","v":3199.6988115707341},null,null,null,null,null,null,null,null,null,null,null,null,null,"CAN",2.1513582000000001E-4,-1.5602854E-5,-1.9699242000000001E-5,1.202254E-5,null,null,null,null,null,null,null,null,"CAN",-1.8965478000000001E-4,-2.2814012999999999E-6,-2.7642321000000001E-6,5.6905476999999998E-6,null,null,null,null,null,null,null,null,null,null,null,null,null,null,null,null,null,null,null,null,null,null,null,null,null,0.5,{"$f":"IF(CA29<100,ROUND(CA29,1),IF(CA29<1000,ROUND(CA29,0),IF(CA29<10000,ROUND(CA29,-1),IF(CA29<100000,ROUND(CA29,-2),IF(CA29>100000,ROUND(CA29,-3),\"\")))))","v":24.4},{"$f":"$CB29*(POWER($Q$9,$CC29))*(POWER($Q$11,$CD29))","v":24.432803179795737},2.9399999999999999E-2,0.89900000000000002,1.75,null,null,"33.29 - 168.0"]
[null,null,null,null,null,null,null,null,null,null,null,null,2E-3,"=",1030,null,null,{"$f":"IF($BY$3=1,O30/AC36,IF($BY$3=2,O30/AP36,IF($BY$3=3,O30/BC36,IF($BY$3=4,O30/BO36,\"error\"))))","v":211.5448150360198},null,{"$f":"IF($BY$3=1,O30*AC36,IF($BY$3=2,O30*AP36,IF($BY$3=3,O30*BC36,IF($BY$3=4,O30*BO36,\"error\"))))","v":5015.0130118734432},null,null,null,null,null,null,"AEP=0.005",null,{"$f":"MMULT(MMULT(TRANSPOSE(AB$2:AB$5),AI30:AL33),AB$2:AB$5)","v":1.6100833901199596E-2},null,5.0000000000000001E-3,0.126,1.6621999999999999,"Intercept",2.8277601999999999E-2,-3.5769763E-3,-9.0535365000000002E-4,2.5475906E-4,null,"AEP=0.005",null,{"$f":"MMULT(MMULT(TRANSPOSE(AO$2:AO$5),AV30:AY33),AO$2:AO$5)","v":1.2456616324568116E-2},null,5.0000000000000001E-3,0.13200000000000001,1.663,"Intercept",3.0005974000000001E-2,-4.4648283999999998E-3,-2.21869E-4,-2.1349998000000001E-4,null,"AEP=0.005",null,{"$f":"MMULT(MMULT(TRANSPOSE(BB$2:BB$4),BI30:BK32),BB$2:BB$4)","v":1.8900476006787754E-2},null,5.0000000000000001E-3,4.7E-2,1.6558999999999999,"Intercept",7.5300000000000006E-2,1.649E-4,-3.8280000000000002E-2,null,"AEP=0.005",null,{"$f":"MMULT(MMULT(TRANSPOSE(BN$2:BN$4),BU30:BW32),BN$2:BN$4)","v":9.2848038666469698E-4},null,5.0000000000000001E-3,4.9000000000000002E-2,1.6560999999999999,"Intercept",6.9350000000000002E-3,-7.2679999999999999E-4,-4.816E-4,null,0.2,41.3,41.349503001675814,5.6500000000000002E-2,0.89500000000000002,1.7,null,null,"not applicable"]
[null,null,null,null,null,null,null,null,null,null,null,null,null,null,null,null,null,null,null,null,null,null,null,null,null,null,null,"Si =",{"$f":"SQRT(AF30 + AC30)","v":0.37696264258040157},null,null,null,null,"DA",-3.5769763E-3,2.1417022000000002E-3,1.9085978E-5,-1.9051648E-5,null,null,"Si =",{"$f":"SQRT(AS30 + AP30)","v":0.38007448786332415},null,null,null,null,"DA",-4.4648283999999998E-3,2.8318059E-3,4.9580464000000004E-6,-3.4494535000000001E-6,null,null,"Si =",{"$f":"SQRT(BF30 + BC30)","v":0.25671088018778587},null,null,null,null,"DA",1.649E-4,6.9110000000000005E-4,-5.7970000000000005E-4,null,null,"Si =",{"$f":"SQRT(BR30 + BO30)","v":0.22344681780384498},null,null,null,null,"DA",-7.2679999999999999E-4,5.5340000000000001E-4,6.5059999999999996E-7,null,0.1,54.2,54.230342655987315,7.9399999999999998E-2,0.89500000000000002,1.67]
[null,null,null,null,null,null,null,null,null,null,null,null,null,null,"*rounded to 3 significant figures",null,null,null,null,null,null,null,null,null,null,null,null,"T =",{"$f":"POWER(10,(AG30*AC31))","v":4.2324058354110239},null,null,null,null,"MAP",-9.0535365000000002E-4,1.9085978E-5,5.5088342000000001E-5,-2.2991111000000001E-5,null,null,"T =",{"$f":"POWER(10,(AT30*AP31))","v":4.2861155326918619},null,null,null,null,"MAP",-2.21869E-4,4.9580464000000004E-6,9.7762831E-6,-3.2099440999999998E-6,null,null,"T =",{"$f":"POWER(10,(BG30*BC31))","v":2.6612614715279777},null,null,null,null,"MAP",-3.8280000000000002E-2,-5.7970000000000005E-4,2.0070000000000001E-2,null,null,"T =",{"$f":"POWER(10,(BS30*BO31))","v":2.3445002045462213},null,null,null,null,"MAP",-4.816E-4,6.5059999999999996E-7,4.5630000000000002E-5,null,0.04,72.5,72.513808691709272,0.115,0.89600000000000002,1.6339999999999999]
[null,null,null,null,null,null,null,null,null,null,null,null,null,null,null,null,null,null,null,null,null,null,null,null,null,null,null,null,null,null,null,null,null,"CAN",2.5475906E-4,-1.9051648E-5,-2.2991111000000001E-5,1.4011717999999999E-5,null,null,null,null,null,null,null,null,"CAN",-2.1349998000000001E-4,-3.4494535000000001E-6,-3.2099440999999998E-6,6.5232150999999998E-6,null,null,null,null,null,null,null,null,null,null,null,null,null,null,null,null,null,null,null,null,null,null,null,null,null,0.02,87.2,87.171950163606141,0.14599999999999999,0.89700000000000002,1.609]
[null,null,null,null,null,null,null,null,null,null,null,null,null,null,null,null,null,null,null,null,null,null,null,null,null,null,"AEP=0.002",null,{"$f":"MMULT(MMULT(TRANSPOSE(AB$2:AB$5),AI34:AL37),AB$2:AB$5)","v":1.9039540527180696E-2},null,2E-3,0.152,1.6621999999999999,"Intercept",3.3186414999999997E-2,-4.1765841000000001E-3,-1.0818002E-3,3.1055143000000002E-4,null,"AEP=0.002",null,{"$f":"MMULT(MMULT(TRANSPOSE(AO$2:AO$5),AV34:AY37),AO$2:AO$5)","v":1.43158114544218E-2},null,2E-3,0.155,1.663,"Intercept",3.445906E-2,-5.1433694000000002E-3,-2.5590253000000001E-4,-2.4533783999999999E-4,null,"AEP=0.002",null,{"$f":"MMULT(MMULT(TRANSPOSE(BB$2:BB$4),BI34:BK36),BB$2:BB$4)","v":2.1435074529507395E-2},null,2E-3,5.1999999999999998E-2,1.6558999999999999,"Intercept",8.5459999999999994E-2,1.9039999999999999E-4,-4.3450000000000003E-2,null,"AEP=0.002",null,{"$f":"MMULT(MMULT(TRANSPOSE(BN$2:BN$4),BU34:BW36),BN$2:BN$4)","v":1.0283095889503241E-3},null,2E-3,5.2999999999999999E-2,1.6560999999999999,"Intercept",7.6629999999999997E-3,-7.9370000000000005E-4,-5.3189999999999997E-4,null,0.01,104,103.60872374651488,0.182,0.89800000000000002,1.587]
[null,null,null,null,null,null,null,null,null,null,null,null,null,null,null,null,null,null,null,null,null,null,null,null,null,null,null,"Si =",{"$f":"SQRT(AF34 + AC34)","v":0.41356926932157406},null,null,null,null,"DA",-4.1765841000000001E-3,2.5474691000000002E-3,2.2916745E-5,-2.4041700000000001E-5,null,null,"Si =",{"$f":"SQRT(AS34 + AP34)","v":0.41148002558377217},null,null,null,null,"DA",-5.1433694000000002E-3,3.3184264999999999E-3,5.5492913999999997E-6,-5.1951380000000002E-6,null,null,"Si =",{"$f":"SQRT(BF34 + BC34)","v":0.27098906717708632},null,null,null,null,"DA",1.9039999999999999E-4,7.7919999999999997E-4,-6.5689999999999998E-4,null,null,"Si =",{"$f":"SQRT(BR34 + BO34)","v":0.23243990532813061},null,null,null,null,"DA",-7.9370000000000005E-4,6.0729999999999996E-4,2.9209999999999998E-7,null,5.0000000000000001E-3,121,120.50865513313994,0.221,0.89900000000000002,1.5669999999999999]
[null,null,null,null,null,null,null,null,null,null,null,null,null,null,null,null,null,null,null,null,null,null,null,null,null,null,null,"T =",{"$f":"POWER(10,(AG34*AC35))","v":4.8689446717217892},null,null,null,null,"MAP",-1.0818002E-3,2.2916745E-5,6.5939853999999996E-5,-2.7560758000000001E-5,null,null,"T =",{"$f":"POWER(10,(AT34*AP35))","v":4.8338289962841277},null,null,null,null,"MAP",-2.5590253000000001E-4,5.5492913999999997E-6,1.1481721E-5,-3.8338296000000003E-6,null,null,"T =",{"$f":"POWER(10,(BG34*BC35))","v":2.8101583734518205},null,null,null,null,"MAP",-4.3450000000000003E-2,-6.5689999999999998E-4,2.2769999999999999E-2,null,null,"T =",{"$f":"POWER(10,(BS34*BO35))","v":2.4262956925971575},null,null,null,null,"MAP",-5.3189999999999997E-4,2.9209999999999998E-7,5.0330000000000001E-5,null,2E-3,145,145.08860865442568,0.28100000000000003,0.9,1.542]
[null,null,null,null,null,null,null,null,null,null,null,null,null,null,null,null,null,null,null,null,null,null,null,null,null,null,null,null,null,null,null,null,null,"CAN",3.1055143000000002E-4,-2.4041700000000001E-5,-2.7560758000000001E-5,1.6769790999999999E-5,null,null,null,null,null,null,null,null,"CAN",-2.4533783999999999E-4,-5.1951380000000002E-6,-3.8338296000000003E-6,7.6649136000000003E-6]
[null,null,null,null,null,null,null,null,null,null,null,null,null,null,null,null,null,null,null,null,null,null,null,null,null,null,null,null,null,null,null,null,null,null,null,null,null,null,null,null,null,null,null,null,null,null,null,null,null,null,null,null,null,null,null,null,null,null,null,null,null,null,null,null,null,null,null,null,null,null,null,null,null,null,null,null,"Region 4",null,null,"Q=aAb10cP",null,null,null,null,"0.18 - 2230"]
[null,null,null,null,null,null,null,null,null,null,null,null,null,null,null,null,null,null,null,null,null,null,null,null,null,null,null,null,null,null,null,null,null,null,null,null,null,null,null,null,null,null,null,null,null,null,null,null,null,null,null,null,null,null,null,null,null,null,null,null,null,null,null,null,null,null,null,null,null,null,null,null,null,null,null,null,0.5,{"$f":"IF(CA39<100,ROUND(CA39,1),IF(CA39<1000,ROUND(CA39,0),IF(CA39<10000,ROUND(CA39,-1),IF(CA39<100000,ROUND(CA39,-2),IF(CA39>100000,ROUND(CA39,-3),\"\")))))","v":278},{"$f":"$CB39*(POWER($Q$9,$CC39))*(POWER(10,($Q$11*$CD39)))","v":278.12083200303925},15.346,0.91100000000000003,7.3000000000000001E-3,null,null,"11.94 - 186.6"]
[null,null,null,null,null,null,null,null,null,null,null,null,null,null,null,null,null,null,null,null,null,null,null,null,null,null,null,null,null,null,null,null,null,null,null,null,null,null,null,null,null,null,null,null,null,null,null,null,null,null,null,null,null,null,null,null,null,null,null,null,null,null,null,null,null,null,null,null,null,null,null,null,null,null,null,null,0.2,527,527.03321989843153,29.785,0.91300000000000003,6.0000000000000001E-3,null,null,"not applicable"]
[null,null,null,null,null,null,null,null,null,null,null,null,null,null,null,null,null,null,null,null,null,null,null,null,null,null,null,null,null,null,null,null,null,null,null,null,null,null,null,null,null,null,null,null,null,null,null,null,null,null,null,null,null,null,null,null,null,null,null,null,null,null,null,null,null,null,null,null,null,null,null,null,null,null,null,null,0.1,739,738.66228705585911,42.073,0.91500000000000004,5.4000000000000003E-3]
[null,null,null,null,null,null,null,null,null,null,null,null,null,null,null,null,null,null,null,null,null,null,null,null,null,null,null,null,null,null,null,null,null,null,null,null,null,null,null,null,null,null,null,null,null,null,null,null,null,null,null,null,null,null,null,null,null,null,null,null,null,null,null,null,null,null,null,null,null,null,null,null,null,null,null,null,0.04,1050,1047.9554872002748,60.116999999999997,0.91800000000000004,4.7000000000000002E-3]
[null,null,null,null,null,null,null,null,null,null,null,null,null,null,null,null,null,null,null,null,null,null,null,null,null,null,null,null,null,null,null,null,null,null,null,null,null,null,null,null,null,null,null,null,null,null,null,null,null,null,null,null,null,null,null,null,null,null,null,null,null,null,null,null,null,null,null,null,null,null,null,null,null,null,null,null,0.02,1310,1306.0082603744499,75.162000000000006,0.92,4.3E-3]
[null,null,null,null,null,null,null,null,null,null,null,null,null,null,null,null,null,null,null,null,null,null,null,null,null,null,null,null,null,null,null,null,null,null,null,null,null,null,null,null,null,null,null,null,null,null,null,null,null,null,null,null,null,null,null,null,null,null,null,null,null,null,null,null,null,null,null,null,null,null,null,null,null,null,null,null,0.01,1580,1582.1479249649453,91.411000000000001,0.92100000000000004,4.0000000000000001E-3]
[null,null,null,null,null,null,null,null,null,null,null,null,null,null,null,null,null,null,null,null,null,null,null,null,null,null,null,null,null,null,null,null,null,null,null,null,null,null,null,null,null,null,null,null,null,null,null,null,null,null,null,null,null,null,null,null,null,null,null,null,null,null,null,null,null,null,null,null,null,null,null,null,null,null,null,null,5.0000000000000001E-3,1880,1878.6706423154021,108.893,0.92300000000000004,3.5999999999999999E-3]
[null,null,null,null,null,null,null,null,null,null,null,null,null,null,null,null,null,null,null,null,null,null,null,null,null,null,null,null,null,null,null,null,null,null,null,null,null,null,null,null,null,null,null,null,null,null,null,null,null,null,null,null,null,null,null,null,null,null,null,null,null,null,null,null,null,null,null,null,null,null,null,null,null,null,null,null,2E-3,{"$f":"IF(CA46<100,ROUND(CA46,1),IF(CA46<1000,ROUND(CA46,0),IF(CA46<10000,ROUND(CA46,-1),IF(CA46<100000,ROUND(CA46,-2),IF(CA46>100000,ROUND(CA46,-3),\"\")))))","v":2320},2321.4117129127508,134.27600000000001,0.92600000000000005,3.3E-3]

{"sheet":"Flood Q Ratio Tool","index":5,"n_rows":526,"n_cols":55,"rows_kept":526,"cut":false,"hidden":false,"merged":[[0,49,0,50],[13,1,17,1],[13,0,17,0],[18,1,19,1],[18,0,19,0],[1,39,1,40],[12,39,12,40],[0,24,0,31],[0,17,1,17],[0,19,1,19],[0,18,1,18],[0,20,1,20],[0,21,1,21],[0,22,1,22],[0,23,1,23],[11,7,12,7],[22,39,22,40],[32,39,32,40],[32,7,33,9],[39,7,40,7],[39,8,40,8],[36,8,37,8],[36,7,37,7],[36,9,37,9],[39,9,40,9],[34,9,35,9],[32,3,33,6],[1,0,3,7],[0,0,0,7],[18,3,19,6],[10,1,12,1],[10,0,12,0],[4,3,5,7],[4,0,5,1],[6,0,7,0],[8,0,9,0],[6,1,7,1],[8,1,9,1],[6,7,8,7],[9,6,10,6],[6,3,8,6],[9,7,10,7],[9,3,10,3],[9,4,10,4],[9,5,10,5],[11,6,12,6],[11,3,12,3],[11,4,12,4],[11,5,12,5]]}
["Flood Q Ratio Tool. Estimates of flood discharge for an ungaged sites in Washington State using the Drainage-Area Ratio Method",null,null,null,null,null,null,null,"Station Index=",71,null,null,null,null,null,null,null,"Map ID","Streamflow Gaging Station Name and Number","Number of peaks in record","Station Number","State","Flood Region","DA (mi2)","Flood Discharges for Indicated Annual Exceedance Probability",null,null,null,null,null,null,null,null,"Region","AEP","Region + AEP","DA exponant",null,null,null,null,null,null,null,null,null,null,"Valid Ranges",null,"Valid ranges"]
["Au, contributing drainage area of ungaged site; Ag, contributing drainage area of the streamflow gaging site; Q(u)g, gage-based estimate of flood discharge in cubic feet per second at ungaged site; Q(u)wtd, weighted estimate of flood discharge in cubic feet per second for the ungaged site and indicated streamflow characteristic; Q(u)reg, regression estimate of flood discharge in cubic feet per second for ungaged site; Q(g)wtd, weighted estimate of flood discharge for streamgaging station]",null,null,null,null,null,null,null,null,null,null,null,null,null,null,null,null,null,null,null,null,null,null,null,0.5,0.2,0.1,0.04,0.02,0.01,5.0000000000000001E-3,2E-3,null,1,0.5,{"$f":"AH2+AI2","v":1.5},0.72799999999999998,null,null,"Region 1",null,null,"Q = aAb10cP/10dCAN",null,null,null,null,"in Text",null,0.25,3304,9.82,52.45,0,77.400000000000006]
[null,null,null,null,null,null,null,null,null,null,null,null,null,null,null,null,null,1,"12009500 BEAR BRANCH NEAR NASELLE, WA",16,12009500,"WA",4,11.71,1120,1640,2000,2470,2830,3200,3570,4090,null,1,0.2,{"$f":"AH3+AI3","v":1.2},0.69199999999999995,null,null,"AEP",null,null,"a","b","c","d",null,"0.25 - 3304",null,0.42,1332,8.86,84.2,0,81.8]
[null,null,null,null,null,null,null,null,null,null,null,null,null,null,null,null,null,2,"12010000 NASELLE RIVER NEAR NASELLE, WA               ",85,12010000,"WA",4,54.896470199999996,5960,7960,9190,10680,11700,12700,13700,15000,null,1,0.1,1.1000000000000001,0.67200000000000004,null,null,0.5,{"$f":"AQ4*(POWER($F$12,AR4))*(POWER(10,(AS4*$I$37)))/(POWER(10,(AT4*$I$40)))","v":832.96728880040291},null,3.8460000000000001,0.745,3.2000000000000001E-2,7.7999999999999996E-3,null,"9.82 - 52.45",null,0.08,2605,33.29,168]
["Instructions for estimating streamflow characteristics at an \nungaged site using the Drainage-Area Ratio Method",null,null,"Estimates of streamflow characteristics based on \nDrainage-Area Ratio method ",null,null,null,null,null,null,null,null,null,null,null,null,null,3,"12010500 SALMON CREEK NEAR NASELLE, WA",12,12010500,"WA",4,16.649999999999999,1730,2090,2320,2600,2810,3000,3200,3460,null,1,0.04,1.04,0.65,null,null,0.2,1579.5898456908358,null,12.106,0.71299999999999997,2.8000000000000001E-2,9.7999999999999997E-3,null,"0.0 - 77.4",null,0.18,2230,11.94,186.6]
[null,null,null,null,null,null,null,null,null,null,null,null,null,null,null,null,null,4,"12010600 LANE CREEK NEAR NASELLE, WA",21,12010600,"WA",4,2.17,176,204,220,237,248,258,268,280,null,1,0.02,1.02,0.63400000000000001,null,null,0.1,2224.1063162142614,null,22.08,0.69499999999999995,2.5999999999999999E-2,1.0699999999999999E-2]
["Steps","Instructions",null,"Contributing drainage areas of the streamflow-gaging station (Ag) and ungaged site (Au), located on the same stream",null,null,null,"Range of drainage areas for which drainage area adjustment is valid",null,null,null,null,null,null,null,null,null,5,"12010700 SOUTH FORK NASELLE RIVER NEAR NASELLE, WA",15,12010700,"WA",4,17.95,2260,3130,3690,4400,4920,5440,5950,6640,null,1,0.01,1.01,0.62,null,null,0.04,3251.234948083898,null,42.17,0.67400000000000004,2.4E-2,1.17E-2]
[null,null,null,null,null,null,null,null,null,null,null,null,null,null,null,null,null,6,"12010800 SOUTH NEMAH RIVER NEAR NASELLE, WA",17,12010800,"WA",4,2.04,238,291,323,360,387,412,436,467,null,1,5.0000000000000001E-3,1.0049999999999999,0.60799999999999998,null,null,0.02,4273.5561198665146,null,63.826000000000001,0.66100000000000003,2.3E-2,1.24E-2]
[1,"Select a streamflow-gaging station from the list box below which is on the same stream as the ungaged site.",null,null,null,null,null,null,null,null,null,null,null,null,null,null,null,7,"12011000 NORTH NEMAH RIVER NEAR SOUTH BEND, WA",20,12011000,"WA",4,18.03,1400,1640,1780,1930,2040,2140,2230,2350,null,1,2E-3,1.002,0.59199999999999997,null,null,0.01,5393.0508478676984,null,92.47,0.64900000000000002,2.1999999999999999E-2,1.2999999999999999E-2]
[null,null,null,"Drainage area of \nselected index site, Ag","=",{"$f":"INDEX(X3:X526,$J$1)","v":15.39},"square miles",{"$f":"\" -- \"","v":" -- "},null,null,null,null,null,null,null,null,null,8,"12011100 NORTH NEMAH RIVER TRIBUTARY NEAR SOUTH BEND, WA       ",18,12011100,"WA",4,0.43,49,65.099999999999994,75.099999999999994,87.2,95.8,104,112,123,null,2,0.5,2.5,0.877,null,null,5.0000000000000001E-3,6574.714922348292,null,129.41999999999999,0.63700000000000001,2.1000000000000001E-2,1.3599999999999999E-2]
[2,"Determine contributing drainage area for ungaged site (Au, in square miles) and enter value in the green cell (F12), where 0.5Ag ≤ Au ≤ 1.5Ag. If the drainage area is outside the appropriate range, the cell will turn red. An initial estimate of the flood discharges will be computed in column G, rows 23 to 30.",null,null,null,null,null,null,null,null,null,null,null,null,null,null,null,9,"12011200 WILLIAMS CREEK NEAR SOUTH BEND, WA",16,12011200,"WA",4,9.43,737,1190,1530,2000,2380,2770,3180,3770,null,2,0.2,2.2000000000000002,0.85499999999999998,null,null,2E-3,8523.7299770730806,null,193.2,0.624,0.02,1.43E-2]
[null,null,null,"Drainage area of ungaged location, Au","=",16.399999999999999,"square miles",{"$f":"ROUND((F10*0.5),1) & \" - \" & ROUND((F10*1.5),1)","v":"7.7 - 23.1"},null,null,null,null,null,null,null,null,null,10,"12011500 WILLAPA RIVER AT LEBAM, WA                 ",27,12011500,"WA",4,41.75,2960,4180,5040,6190,7090,8040,9020,10400,null,2,0.1,2.1,0.84099999999999997]
[null,null,null,null,null,null,null,null,null,null,null,null,null,null,null,null,null,11,"12012000 FORK CREEK NEAR LEBAM, WA",27,12012000,"WA",4,20.32,2410,3330,3970,4830,5500,6190,6920,7930,null,2,0.04,2.04,0.82299999999999995,null,null,"Region 2",null,null,"Q =aAb10cP/10dCAN",null,null,null,null,"0.42 - 1322"]
[3,"The estimates will be improved by computing weighted estimates using the regional regression estimates.  To do this, enter the Mean Annual Precipitation in the green box (column I, row x).  If the site is in regression region 1 or 2, enter the percent canopy coverage for the ungaged basin in the green box (column I, row x).  If either of these values are outside the acceptible range, the cell will turn red.",null,null,null,null,null,null,null,null,null,null,null,null,null,null,null,12,"12012200 GREEN CREEK NEAR LEBAM, WA",21,12012200,"WA",4,1.79,134,191,231,285,326,369,413,476,null,2,0.02,2.02,0.81200000000000006,null,null,0.5,{"$f":"AQ14*(POWER($F$12,AR14))*(POWER(10,(AS14*$I$37)))/(POWER(10,(AT14*$I$40)))","v":228.90532821116406},null,1.4450000000000001,0.877,2.53E-2,2E-3,null,"8.86 - 84.20"]
[null,null,null,null,null,null,"Station Number","Number of Years of Record",null,null,null,null,null,null,null,null,null,13,"12013500 WILLAPA RIVER NEAR WILLAPA, WA               ",63,12013500,"WA",4,130.38033294000002,8810,10900,12200,13600,14700,15600,16500,17700,null,2,0.01,2.0099999999999998,0.80100000000000005,null,null,0.2,577.79125050145331,null,5.7679999999999998,0.86,2.1399999999999999E-2,6.1000000000000004E-3,null,"0.0 - 81.8"]
[null,null,null,"Selected Streamflow-gaging Station:",null,null,{"$f":"INDEX(U3:U526,$J$1)","v":12047500},{"$f":"INDEX(T3:T526,J1)","v":17},null,null,null,null,null,null,null,null,null,14,"12014500 SOUTH FORK WILLAPA RIVER NEAR RAYMOND, WA",26,12014500,"WA",4,27.67,1650,2310,2750,3330,3770,4210,4670,5280,null,2,5.0000000000000001E-3,2.0049999999999999,0.79200000000000004,null,null,0.1,947.2691830158218,null,12.106,0.84699999999999998,1.9400000000000001E-2,8.2000000000000007E-3]
[null,null,null,null,null,null,null,null,null,null,null,null,null,null,null,null,null,15,"12015100 CLEARWATER CREEK NEAR RAYMOND, WA",15,12015100,"WA",4,3.99,268,401,493,613,705,798,893,1020,null,2,2E-3,2.0019999999999998,0.78,null,null,0.04,1613.7078166753545,null,26.484999999999999,0.83299999999999996,1.7399999999999999E-2,1.0500000000000001E-2]
[null,null,null,"Regression Region:",{"$f":"INDEX(W3:W526,J1)","v":3},null,null,null,null,null,null,null,null,null,null,null,null,16,"12015500 NORTH RIVER NEAR BROOKLYN, WA",12,12015500,"WA",4,29.71,1670,2220,2560,2960,3250,3540,3810,4170,null,3,0.5,3.5,0.89900000000000002,null,null,0.02,2289.1581410244448,null,43.853000000000002,0.82299999999999995,1.6199999999999999E-2,1.1900000000000001E-2]
[4,"The final answer, the weighted estimates of flood discharge (Q(u)wtd), will be listed in column G, rows 37-44.",null,"Initial estimate of Flood Discharges at ungaged site,             Qu (eq. 10)",null,null,null,null,null,null,null,null,null,null,null,null,null,17,"12016700 JOE CREEK NEAR COSMOPOLIS, WA",22,12016700,"WA",4,2,153,209,245,291,325,358,392,438,null,3,0.2,3.2,0.89500000000000002,null,null,0.01,3106.8051468320941,null,68.549000000000007,0.81399999999999995,1.5100000000000001E-2,1.32E-2]
[null,null,null,null,null,null,null,null,null,null,null,null,null,null,null,null,null,18,"12017000 NORTH RIVER NEAR RAYMOND, WA",58,12017000,"WA",4,219.72,8800,12300,14800,18300,21000,23900,26900,31300,null,3,0.1,3.1,0.89500000000000002,null,null,5.0000000000000001E-3,{"$f":"AQ20*(POWER($F12,AR20))*(POWER(10,(AS20*$I$37)))/(POWER(10,(AT20*$I$40)))","v":4127.1783101593846},null,103.514,0.80600000000000005,1.41E-2,1.4500000000000001E-2]
[null,null,null,null,null,null,null,null,null,null,null,null,null,null,null,null,null,19,"12019600 WATER MILL CREEK NEAR PE ELL, WA",21,12019600,"WA",4,1.94,89.5,119,138,160,177,192,208,229,null,3,0.04,3.04,0.89600000000000002,null,null,2E-3,{"$f":"AQ21*(POWER($F12,AR21))*(POWER(10,(AS21*$I$37)))/(POWER(10,(AT21*$I$40)))","v":5861.3110461992492},null,169.82400000000001,0.79600000000000004,1.2999999999999999E-2,1.5900000000000001E-2]
[null,null,null,"AEP",null,"Q(g)wtd","Q(u)g, ft3/s",null,null,null,null,null,null,null,null,null,null,20,"12020000 CHEHALIS RIVER NEAR DOTY, WA",75,12020000,"WA",4,113.59969335,10100,15500,19700,25800,31000,36600,42800,51900,null,3,0.02,3.02,0.89700000000000002]
[null,null,null,0.5,"=",{"$f":"INDEX(Y$3:Y$526,$J$1)","v":395},{"$f":"(($F$12/$F$10)^(VLOOKUP(($E$18+$D23),AJ2:AK33,2,FALSE)))*$F23","v":418.22905035234163},null,null,null,null,null,null,null,null,null,null,21,"12020500 ELK CREEK NEAR DOTY, WA",33,12020500,"WA",4,46.75,1720,2420,2910,3550,4050,4560,5090,5830,null,3,0.01,3.01,0.89800000000000002,null,null,"Region 3",null,null,"Q=aAbPc",null,null,null,null,"0.08 - 2605"]
[null,null,null,0.2,"=",{"$f":"INDEX(Z$3:Z$526,$J$1)","v":765},809.78199152368109,null,null,null,null,null,null,null,null,null,null,22,"12020800 SOUTH FORK CHEHALIS RIVER NEAR WILDWOOD, WA",16,12020800,"WA",4,26.95,3180,5110,6560,8570,10200,11900,13600,16100,null,3,5.0000000000000001E-3,3.0049999999999999,0.89900000000000002,null,null,0.5,{"$f":"AQ24*(POWER($F$12,AR24))*(POWER($I$37,AS24))","v":283.08903406956347},null,2.9399999999999999E-2,0.89900000000000002,1.75,null,null,"33.29 - 168.0"]
[null,null,null,0.1,"=",{"$f":"INDEX(AA$3:AA$526,$J$1)","v":1040},1100.8800930518019,null,null,null,null,null,null,null,null,null,null,23,"12020900 SOUTH FORK CHEHALIS RIVER NEAR BOISTFORT, WA",15,12020900,"WA",4,45.24,2800,4070,4950,6110,7000,7920,8860,10200,null,3,2E-3,3.0019999999999998,0.9,null,null,0.2,{"$f":"AQ25*(POWER($F$12,AR25))*(POWER($I$37,AS25))","v":444.78739542677732},null,5.6500000000000002E-2,0.89500000000000002,1.7,null,null,"not applicable"]
[null,null,null,0.04,"=",{"$f":"INDEX(AB$3:AB$526,$J$1)","v":1390},1471.4621140490401,null,null,null,null,null,null,null,null,null,null,24,"12021000 SOUTH FORK CHEHALIS RIVER AT BOISTFORT, WA",21,12021000,"WA",4,48.13,3210,4020,4520,5140,5590,6030,6470,7050,null,4,0.5,4.5,0.91100000000000003,null,null,0.1,{"$f":"AQ26*(POWER($F$12,AR26))*(POWER($I$37,AS26))","v":557.64413117333538},null,7.9399999999999998E-2,0.89500000000000002,1.67]
[null,null,null,0.02,"=",{"$f":"INDEX(AC$3:AC$526,$J$1)","v":1640},1736.2239301765726,null,null,null,null,null,null,null,null,null,null,25,"12024000 SOUTH FORK NEWAUKUM RIVER NEAR ONALASKA, WA  ",41,12024000,"WA",4,42.201965520000002,2510,3740,4590,5680,6510,7340,8190,9350,null,4,0.2,4.2,0.91300000000000003,null,null,0.04,{"$f":"AQ27*(POWER($F$12,AR27))*(POWER($I$37,AS27))","v":706.26624361676113},null,0.115,0.89600000000000002,1.6339999999999999]
[null,null,null,0.01,"=",{"$f":"INDEX(AD$3:AD$526,$J$1)","v":1880},1990.4319955124167,null,null,null,null,null,null,null,null,null,null,26,"12024400 NF NEWAUKUM RIVER ABV BEAR CREEK NR FOREST, WA",16,12024400,"WA",4,29.69,1610,2810,3700,4920,5870,6840,7820,9210,null,4,0.1,4.0999999999999996,0.91500000000000004,null,null,0.02,{"$f":"AQ28*(POWER($F$12,AR28))*(POWER($I$37,AS28))","v":817.58356016640255},null,0.14599999999999999,0.89700000000000002,1.609]
[null,null,null,5.0000000000000001E-3,"=",{"$f":"INDEX(AE$3:AE$526,$J$1)","v":2120},2244.6723715113021,null,null,null,null,null,null,null,null,null,null,27,"12025000 NEWAUKUM RIVER NEAR CHEHALIS, WA              ",74,12025000,"WA",4,156.33331857000002,6240,8610,10100,11900,13100,14400,15600,17100,null,4,0.04,4.04,0.91800000000000004,null,null,0.01,{"$f":"AQ29*(POWER($F$12,AR29))*(POWER($I37,AS29))","v":939.9745750109355},null,0.182,0.89800000000000002,1.587]
[null,null,null,2E-3,"=",{"$f":"INDEX(AF$3:AF$526,$J$1)","v":2440},2583.6550633301658,null,null,null,null,null,null,null,null,null,null,28,"12025300 SALZER CREEK NEAR CENTRALIA, WA",11,12025300,"WA",4,12.64,312,317,319,322,324,326,327,329,null,4,0.02,4.0199999999999996,0.92,null,null,5.0000000000000001E-3,{"$f":"AQ30*(POWER($F$12,AR30))*(POWER($I$37,AS30))","v":1060.7350253239149},null,0.221,0.89900000000000002,1.5669999999999999]
[null,null,null,null,null,null,null,null,"2(|Ag-Au|)/Ag=",{"$f":"2*(ABS($F$10-$F$12)/F10)","v":0.13125406107862223},null,null,null,null,null,null,null,29,"12025700 SKOOKUMCHUCK RIVER NEAR VAIL, WA              ",47,12025700,"WA",4,39.885249689999995,2810,4430,5560,7020,8110,9220,10300,11800,null,4,0.01,4.01,0.92100000000000004,null,null,2E-3,{"$f":"AQ31*(POWER($F$12,AR31))*(POWER($I$37,AS31))","v":1229.7862726568499},null,0.28100000000000003,0.9,1.542]
[null,null,null,"Regression Region:",{"$f":"INDEX(W3:W526,J1)","v":3},null,null,null,null,null,null,null,null,null,null,null,null,30,"12026000 SKOOKUMCHUCK RIVER NEAR CENTRALIA, WA",34,12026000,"WA",4,61.24,3580,4690,5380,6210,6800,7380,7950,8700,null,4,5.0000000000000001E-3,4.0049999999999999,0.92300000000000004]
[null,null,null,"Weighted estimate of Flood Discharge at ungaged site, using regression estimate, Q(u)wtd  (eq. 11)",null,null,null,"Basin Characteristics for Regional Regression Estimate, Q(u)reg",null,null,null,null,null,null,null,null,null,31,"12026150 SKOOKUMCHUCK RIVER BLW BLDY RUN CR NR CENTRALIA, WA",75,12026150,"WA",4,65.66,3590,4710,5410,6270,6890,7510,8110,8920,null,4,2E-3,4.0019999999999998,0.92600000000000005,null,null,"Region 4",null,null,"Q=aAb10cP",null,null,null,null,"0.18 - 2230"]
[null,null,null,null,null,null,null,null,null,null,null,null,null,null,null,null,null,32,"12026300 SKOOKUMCHUCK RIVER TRIBUTARY NEAR BUCODA, WA",16,12026300,"WA",4,0.62,34.700000000000003,48.5,57.5,68.7,77,85.4,93.7,105,null,null,null,null,null,null,null,0.5,{"$f":"AQ34*(POWER($F$12,AR34))*(POWER(10,($I$37*AS34)))","v":417.33800862986567},null,15.346,0.91100000000000003,7.3000000000000001E-3,null,null,"11.94 - 186.6"]
[null,null,null,null,null,null,null,null,null,"Applicable Range",null,null,null,null,null,null,null,33,"12027500 CHEHALIS RIVER NEAR GRAND MOUND, WA             ",86,12027500,"WA",4,898.28327160000003,25700,36800,44600,55200,63500,72200,81400,94300,null,null,null,null,null,null,null,0.2,712.1148423446715,null,29.785,0.91300000000000003,6.0000000000000001E-3,null,null,"not applicable"]
[null,null,null,"AEP",null,"Q(u)reg","*Q(u)wtd",null,null,null,null,null,null,"Q(u)wtd",null,null,null,34,"12029700 CHEHALIS RIVER NEAR OAKVILLE, WA",30,12029700,"WA",4,1158.27,29000,36800,41900,48300,53000,57800,62600,69100,null,null,null,null,null,null,null,0.1,950.70461322005019,null,42.073,0.91500000000000004,5.4000000000000003E-3]
[null,null,null,0.5,"=",{"$f":"IF($E$32=1,AO4,IF($E$32=2,AO14,IF($E$32=3,AO24,IF($E$32=4,AO34,\"error\"))))","v":283.08903406956347},{"$f":"IF(N37<100,ROUND(N37,1),IF(N37<1000,ROUND(N37,0),IF(N37<10000,ROUND(N37,-1),IF(N37<100000,ROUND(N37,-2),IF(N37>100000,ROUND(N37,-3),\"\")))))","v":400},"Enter Mean Annual Precipitation of ungaged basin=",44.9,{"$f":"IF(E32=1,AV4,IF(E32=2,AV14,IF(E32=3,AV24,IF(E32=4,AV34))))","v":"33.29 - 168.0"},null,null,null,{"$f":"($J$31*$F37) + ((1 - $J$31)*$G23)","v":400.49137440099588},null,null,null,35,"12030000 ROCK CREEK AT CEDARVILLE, WA",30,12030000,"WA",4,24.557465789999998,1120,1350,1480,1620,1720,1820,1910,2020,null,null,null,null,null,null,null,0.04,1274.2479761977195,null,60.116999999999997,0.91800000000000004,4.7000000000000002E-3]
[null,null,null,0.2,"=",{"$f":"IF($E$32=1,AO5,IF($E$32=2,AO15,IF($E$32=3,AO25,IF($E$32=4,AO35,\"error\"))))","v":444.78739542677732},{"$f":"IF(N38<100,ROUND(N38,1),IF(N38<1000,ROUND(N38,0),IF(N38<10000,ROUND(N38,-1),IF(N38<100000,ROUND(N38,-2),IF(N38>100000,ROUND(N38,-3),\"\")))))","v":762},null,null,null,null,null,null,{"$f":"($J$31*$F38) + ((1 - $J$31)*$G24)","v":761.87496851421099},null,null,null,36,"12031000 CHEHALIS RIVER AT PORTER, WA                ",65,12031000,"WA",4,1297.6392429,29800,41200,49300,60100,68700,77700,87200,101000,null,null,null,null,null,null,null,0.02,1537.1797972473701,null,75.162000000000006,0.92,4.3E-3]
[null,null,null,0.1,"=",{"$f":"IF($E$32=1,AO6,IF($E$32=2,AO16,IF($E$32=3,AO26,IF($E$32=4,AO36,\"error\"))))","v":557.64413117333538},1030,null,null,null,null,null,null,{"$f":"($J$31*$F39) + ((1 - $J$31)*$G25)","v":1029.5781669313014},null,null,null,37,"12032500 CLOQUALLUM CREEK AT ELMA, WA                ",36,12032500,"WA",4,66.350783070000006,3180,4210,4850,5630,6200,6750,7290,8000,null,null,null,null,null,null,null,0.01,1817.4800148810546,null,91.411000000000001,0.92100000000000004,4.0000000000000001E-3]
[null,null,null,0.04,"=",706.26624361676113,1370,"If ungaged location is in regression region 1 or 2, enter percent canopy coverage= ",0.8,{"$f":"IF(E32=1,AV5,IF(E32=2,AV15,IF(E32=3,AV25,IF(E32=4,AV35))))","v":"not applicable"},null,null,null,{"$f":"($J$31*$F40) + ((1 - $J$31)*$G26)","v":1371.0270485342121},null,null,null,38,"12034200 EAST FORK SATSOP RIVER NEAR ELMA, WA",16,12034200,"WA",4,63.36,3010,3940,4510,5200,5680,6150,6600,7200,null,null,null,null,null,null,null,5.0000000000000001E-3,2089.0115180277107,null,108.893,0.92300000000000004,3.5999999999999999E-3]
[null,null,null,0.02,"=",817.58356016640255,1620,null,null,null,null,null,null,{"$f":"($J$31*$F41) + ((1 - $J$31)*$G27)","v":1615.6486509419697},null,null,null,39,"12034700 WEST FORK SATSOP RIVER TRIBUTARY NEAR MATLOCK, WA",20,12034700,"WA",4,0.31,54.1,64.400000000000006,70.400000000000006,77.400000000000006,82.2,86.7,91.1,96.7,null,null,null,null,null,null,null,2E-3,2518.3367240433608,null,134.27600000000001,0.92600000000000005,3.3E-3]
[null,null,null,0.01,"=",939.9745750109355,1850,null,null,null,null,null,null,{"$f":"($J$31*$F42) + ((1 - $J$31)*$G28)","v":1852.5551930814233},null,null,null,40,"12035000 SATSOP RIVER NEAR SATSOP, WA                ",83,12035000,"WA",4,297.25823556,25900,35400,41200,48100,53000,57700,62200,68000]
[null,null,null,5.0000000000000001E-3,"=",1060.7350253239149,{"$f":"IF(N43<100,ROUND(N43,1),IF(N43<1000,ROUND(N43,0),IF(N43<10000,ROUND(N43,-1),IF(N43<100000,ROUND(N43,-2),IF(N43>100000,ROUND(N43,-3),\"\")))))","v":2090},null,null,null,null,null,null,2089.275786761561,null,null,null,41,"12035450 BIG CREEK NEAR GRISDALE, WA                 ",25,12035450,"WA",4,9.53547309,2320,3030,3470,4000,4370,4730,5070,5520]
[null,null,null,2E-3,"=",1229.7862726568499,2410,null,null,null,null,null,null,2405.95428638669,null,null,null,42,"12035500 WYNOOCHEE RIVER AT OXBOW NEAR ABERDEEN, WA",27,12035500,"WA",4,70.62,9880,12800,14500,16600,18200,19600,21000,22900]
[null,null,null,null,null,null,null,null,null,null,null,null,null,null,null,null,null,43,"12036000 WYNOOCHEE RIVER ABV SAVE CREEK NEAR ABERDEEN, WA",62,12036000,"WA",4,73.64,12500,17200,20400,24400,27400,30400,33300,37400]
[null,null,null,null,null,null,"*rounded to 3 significant figures",null,null,null,null,null,null,null,null,null,null,44,"12036400 SCHAFER CREEK NEAR GRISDALE, WA",11,12036400,"WA",4,12.35,1780,2570,3120,3820,4360,4900,5450,6210]
[null,null,null,null,null,null,null,null,null,null,null,null,null,null,null,null,null,45,"12036650 ANDERSON CREEK NEAR MONTESANO, WA",13,12036650,"WA",4,2.79,255,361,432,521,588,654,721,811]
[null,null,null,null,null,null,null,null,null,null,null,null,null,null,null,null,null,46,"12037400 WYNOOCHEE RIVER ABV BLACK CREEK NR MONTESANO, WA",58,12037400,"WA",4,154.30000000000001,16500,21800,25200,29100,31900,34700,37300,40800]
[null,null,null,null,null,null,null,null,null,null,null,null,null,null,null,null,null,47,"12038750 GIBSON CREEK NEAR QUINAULT, WA",11,12038750,"WA",4,1.18,275,353,404,467,514,561,608,671]
[null,null,null,null,null,null,null,null,null,null,null,null,null,null,null,null,null,48,"12039005 HUMPTULIPS RIVER BELOW HWY 101 NR HUMPTULIPS, WA*     ",51,12039005,"WA",4,132.78809114999999,20200,27200,31600,37100,41000,44900,48800,53800]
[null,null,null,null,null,null,null,null,null,null,null,null,null,null,null,null,null,49,"12039050 BIG CREEK NEAR HOQUIAM, WA",22,12039050,"WA",4,0.32,60.5,88.3,107,131,149,167,185,209]
[null,null,null,null,null,null,null,null,null,null,null,null,null,null,null,null,null,50,"12039100 BIG CREEK TRIBUTARY NEAR HOQUIAM, WA",20,12039100,"WA",4,0.18,16.2,21.1,24.1,27.5,29.9,32.200000000000003,34.299999999999997,37.1]
[null,null,null,null,null,null,null,null,null,null,null,null,null,null,null,null,null,51,"12039300 NORTH FORK QUINAULT RIVER NEAR AMANDA PARK, WA",22,12039300,"WA",4,73.78,16200,22800,27100,32400,36300,40100,43900,48900]
[null,null,null,null,null,null,null,null,null,null,null,null,null,null,null,null,null,52,"12039400 HIGLEY CREEK NEAR AMANDA PARK, WA",20,12039400,"WA",4,0.79,178,259,314,385,438,492,547,622]
[null,null,null,null,null,null,null,null,null,null,null,null,null,null,null,null,null,53,"12039500 QUINAULT RIVER AT QUINAULT LAKE, WA             ",101,12039500,"WA",4,265.70158758000002,23600,32800,38700,45800,50900,55800,60700,67000]
[null,null,null,null,null,null,null,null,null,null,null,null,null,null,null,null,null,54,"12040000 CLEARWATER RIVER NEAR CLEARWATER, WA",31,12040000,"WA",4,140.96,19900,26300,30500,35800,39800,43700,47600,52900]
[null,null,null,null,null,null,null,null,null,null,null,null,null,null,null,null,null,55,"12040500 QUEETS RIVER NEAR CLEARWATER, WA              ",84,12040500,"WA",4,445.34202569999997,67300,88100,101000,118000,130000,141000,153000,168000]
[null,null,null,null,null,null,null,null,null,null,null,null,null,null,null,null,null,56,"12041000 HOH RIVER NEAR FORKS, WA",38,12041000,"WA",4,207.51,19000,26000,30800,36800,41400,46000,50600,56900]
[null,null,null,null,null,null,null,null,null,null,null,null,null,null,null,null,null,57,"12041200 HOH RIVER AT US HIGHWAY 101 NEAR FORKS, WA         ",54,12041200,"WA",4,253.20310587,32700,44800,52300,61300,67600,73600,79400,86900]
[null,null,null,null,null,null,null,null,null,null,null,null,null,null,null,null,null,58,"12041500 SOLEDUCK RIVER NEAR FAIRHOLM, WA              ",63,12041500,"WA",4,84.143661030000004,9500,13500,16200,19600,22100,24600,27200,30600]
[null,null,null,null,null,null,null,null,null,null,null,null,null,null,null,null,null,59,"12041600 SOLEDUCK RIVER TRIBUTARY NEAR FAIRHOLM, WA",20,12041600,"WA",4,0.43,26,38.6,47.3,58.7,67.599999999999994,76.599999999999994,85.9,98.7]
[null,null,null,null,null,null,null,null,null,null,null,null,null,null,null,null,null,60,"12042700 MAY CREEK NEAR FORKS, WA",19,12042700,"WA",4,2.0699999999999998,484,623,705,799,864,924,981,1050]
[null,null,null,null,null,null,null,null,null,null,null,null,null,null,null,null,null,61,"12042900 GRADER CREEK NEAR FORKS, WA",39,12042900,"WA",4,1.73,323,420,480,551,602,651,698,759]
[null,null,null,null,null,null,null,null,null,null,null,null,null,null,null,null,null,62,"12043000 CALAWAH RIVER NEAR FORKS, WA                ",117,12043000,"WA",4,130.1871285,20300,28000,33000,39200,43700,48100,52500,58200]
[null,null,null,null,null,null,null,null,null,null,null,null,null,null,null,null,null,63,"12043100 DICKEY RIVER NEAR LA PUSH, WA",18,12043100,"WA",4,84.27,8280,11200,13100,15600,17500,19400,21400,24100]
[null,null,null,null,null,null,null,null,null,null,null,null,null,null,null,null,null,64,"12043163 TSOO-YESS RIVER BELOW MILLER CREEK NEAR OZETTE, WA",15,12043163,"WA",4,31.78,3520,4700,5440,6340,6970,7590,8200,9000]
[null,null,null,null,null,null,null,null,null,null,null,null,null,null,null,null,null,65,"12043300 HOKO RIVER NEAR SEKIU, WA                  ",52,12043300,"WA",4,52.200295290000007,7420,10600,12700,15500,17600,19600,21700,24500]
[null,null,null,null,null,null,null,null,null,null,null,null,null,null,null,null,null,66,"12043430 EAST TWIN RIVER NEAR PYSHT, WA",16,12043430,"WA",4,13.88,981,1120,1190,1280,1330,1390,1440,1500]
[null,null,null,null,null,null,null,null,null,null,null,null,null,null,null,null,null,67,"12044000 LYRE RIVER AT PIEDMONT, WA",10,12044000,"WA",3,49.16,802,1150,1400,1740,2000,2290,2580,2970]
[null,null,null,null,null,null,null,null,null,null,null,null,null,null,null,null,null,68,"12044900 ELWHA RIVER ABV LAKE MILLS NR PORT ANGELES, WA",13,12044900,"WA",3,198.23,13000,18300,21700,25900,29000,32100,35200,39300]
[null,null,null,null,null,null,null,null,null,null,null,null,null,null,null,null,null,69,"12045500 ELWHA RIVER AT MCDONALD BR NEAR PORT ANGELES",100,12045500,"WA",3,268.48884348000001,14100,21100,25900,32100,36800,41500,46200,52500]
[null,null,null,null,null,null,null,null,null,null,null,null,null,null,null,null,null,72,"12047300 MORSE CREEK NEAR PORT ANGELES, WA",13,12047300,"WA",3,46.66,1300,2180,2840,3730,4410,5120,5840,6840]
[null,null,null,null,null,null,null,null,null,null,null,null,null,null,null,null,null,73,"12047500 SIEBERT CREEK NEAR PORT ANGELES, WA",17,12047500,"WA",3,15.39,395,765,1040,1390,1640,1880,2120,2440]
[null,null,null,null,null,null,null,null,null,null,null,null,null,null,null,null,null,74,"12047700 GOLD CREEK NEAR BLYN, WA",11,12047700,"WA",3,2.42,64.900000000000006,103,131,167,194,222,251,290]
[null,null,null,null,null,null,null,null,null,null,null,null,null,null,null,null,null,75,"12048000 DUNGENESS RIVER NEAR SEQUIM, WA               ",84,12048000,"WA",3,156.37293242999999,3120,4680,5710,7000,7960,8920,9880,11200]
[null,null,null,null,null,null,null,null,null,null,null,null,null,null,null,null,null,76,"12049400 DEAN CREEK AT BLYN, WA",22,12049400,"WA",3,2.98,28.1,46.9,61.3,81.400000000000006,97.4,115,133,158]
[null,null,null,null,null,null,null,null,null,null,null,null,null,null,null,null,null,77,"12050500 SNOW CREEK NEAR MAYNARD, WA                 ",27,12050500,"WA",3,11.295509940000001,211,363,476,628,745,865,987,1150]
[null,null,null,null,null,null,null,null,null,null,null,null,null,null,null,null,null,78,"12052210 BIG QUILCENE RIVER BLW DIVERSION NR QUILCENE, WA",21,12052210,"WA",3,49.38,2010,3130,3930,4970,5770,6580,7400,8540]
[null,null,null,null,null,null,null,null,null,null,null,null,null,null,null,null,null,79,"12052400 PENNY CREEK NEAR QUILCENE, WA",20,12052400,"WA",3,6.75,210,352,455,589,691,794,899,1040]
[null,null,null,null,null,null,null,null,null,null,null,null,null,null,null,null,null,80,"12053000 DOSEWALLIPS RIVER NEAR BRINNON, WA",38,12053000,"WA",3,93.35,4330,6550,8100,10100,11600,13200,14800,16900]
[null,null,null,null,null,null,null,null,null,null,null,null,null,null,null,null,null,81,"12053400 DOSEWALLIPS RIVER TRIBUTARY NEAR BRINNON, WA",20,12053400,"WA",3,0.64,37.1,49.7,57.8,67.900000000000006,75.3,82.8,90.4,100]
[null,null,null,null,null,null,null,null,null,null,null,null,null,null,null,null,null,82,"12054000 DUCKABUSH RIVER NEAR BRINNON, WA",76,12054000,"WA",3,66.260000000000005,4890,6740,7900,9280,10300,11200,12100,13400]
[null,null,null,null,null,null,null,null,null,null,null,null,null,null,null,null,null,83,"12054500 HAMMA HAMMA RIVER NEAR ELDON, WA",28,12054500,"WA",3,51.38,3490,4800,5650,6710,7500,8290,9080,10100]
[null,null,null,null,null,null,null,null,null,null,null,null,null,null,null,null,null,84,"12054600 JEFFERSON CREEK NEAR ELDON, WA",22,12054600,"WA",3,21.76,2370,2740,2960,3210,3390,3560,3730,3940]
[null,null,null,null,null,null,null,null,null,null,null,null,null,null,null,null,null,85,"12056300 ANNAS BAY TRIBUTARY NO. 2 NEAR POTLATCH, WA",21,12056300,"WA",3,0.85,53.2,98.1,134,183,221,260,299,353]
[null,null,null,null,null,null,null,null,null,null,null,null,null,null,null,null,null,86,"12056500 NF SKOKOMISH R BL STAIRCASE RPDS NR HOODSPORT   ",90,12056500,"WA",3,56.745696149999993,6950,10600,13200,16600,19200,21900,24600,28400]
[null,null,null,null,null,null,null,null,null,null,null,null,null,null,null,null,null,88,"12058000 DEER MEADOW CREEK NEAR HOODSPORT, WA",27,12058000,"WA",3,0.53,108,178,226,285,327,365,402,450]
[null,null,null,null,null,null,null,null,null,null,null,null,null,null,null,null,null,89,"12059800 SOUTH FORK SKOKOMISH RIVER NEAR HOODSPORT, WA",15,12059800,"WA",3,26.17,3810,4750,5320,5980,6450,6910,7360,7930]
[null,null,null,null,null,null,null,null,null,null,null,null,null,null,null,null,null,90,"12060000 SOUTH FORK SKOKOMISH RIVER NEAR POTLATCH, WA",27,12060000,"WA",3,63.65,8490,12500,15200,18700,21300,23800,26400,29800]
[null,null,null,null,null,null,null,null,null,null,null,null,null,null,null,null,null,91,"12060500 SOUTH FORK SKOKOMISH RIVER NEAR UNION, WA          ",71,12060500,"WA",3,76.552741980000008,12000,15800,18200,21000,23100,25000,27000,29500]
[null,null,null,null,null,null,null,null,null,null,null,null,null,null,null,null,null,92,"12061200 FIR CREEK TRIBUTARY NEAR POTLATCH, WA",20,12061200,"WA",3,0.79,136,187,220,261,292,321,351,392]
[null,null,null,null,null,null,null,null,null,null,null,null,null,null,null,null,null,93,"12063000 UNION RIVER NEAR BREMERTON, WA",14,12063000,"WA",3,3.42,276,384,450,529,586,641,695,768]
[null,null,null,null,null,null,null,null,null,null,null,null,null,null,null,null,null,94,"12063500 UNION RIVER NEAR BELFAIR, WA",12,12063500,"WA",3,18.14,897,1170,1340,1550,1710,1870,2020,2240]
[null,null,null,null,null,null,null,null,null,null,null,null,null,null,null,null,null,95,"12065500 GOLD CREEK NEAR BREMERTON, WA                ",33,12065500,"WA",3,1.5466779899999998,128,172,199,233,257,280,303,333]
[null,null,null,null,null,null,null,null,null,null,null,null,null,null,null,null,null,96,"12066000 TAHUYA RIVER NEAR BREMERTON, WA",11,12066000,"WA",3,6.06,323,436,505,589,649,709,768,845]
[null,null,null,null,null,null,null,null,null,null,null,null,null,null,null,null,null,97,"12067500 TAHUYA RIVER NEAR BELFAIR, WA",10,12067500,"WA",3,16,702,904,1030,1190,1310,1430,1550,1700]
[null,null,null,null,null,null,null,null,null,null,null,null,null,null,null,null,null,98,"12068500 DEWATTO RIVER NEAR DEWATTO, WA               ",32,12068500,"WA",3,18.645618420000002,1030,1410,1660,1980,2210,2440,2680,3000]
[null,null,null,null,null,null,null,null,null,null,null,null,null,null,null,null,null,99,"12069550 BIG BEEF CREEK NEAR SEABECK, WA               ",29,12069550,"WA",3,12.863732310000001,658,1010,1260,1590,1840,2090,2350,2700]
[null,null,null,null,null,null,null,null,null,null,null,null,null,null,null,null,null,100,"12070000 DOGFISH CREEK NEAR POULSBO, WA               ",28,12070000,"WA",3,5.1953229900000002,134,195,237,293,336,380,426,489]
[null,null,null,null,null,null,null,null,null,null,null,null,null,null,null,null,null,101,"12072000 CHICO CREEK NEAR BREMERTON, WA",21,12072000,"WA",3,15.5,478,702,864,1080,1260,1440,1620,1890]
[null,null,null,null,null,null,null,null,null,null,null,null,null,null,null,null,null,103,"12073500 HUGE CREEK NEAR WAUNA, WA                  ",58,12073500,"WA",3,6.0511908599999993,142,261,357,493,603,718,838,1000]
[null,null,null,null,null,null,null,null,null,null,null,null,null,null,null,null,null,104,"12076500 GOLDSBOROUGH CREEK NEAR SHELTON, WA             ",28,12076500,"WA",3,45.178564860000002,828,1140,1360,1640,1850,2080,2320,2640]
[null,null,null,null,null,null,null,null,null,null,null,null,null,null,null,null,null,105,"12076800 GOLDSBOROUGH CREEK ABOVE 7TH STREET AT SHELTON, WA",10,12076800,"WA",3,60.41,1600,2430,3080,3970,4690,5480,6290,7430]
[null,null,null,null,null,null,null,null,null,null,null,null,null,null,null,null,null,106,"12078400 KENNEDY CREEK NEAR KAMILCHE, WA",33,12078400,"WA",3,17.149999999999999,727,1070,1310,1620,1850,2090,2330,2650]
[null,null,null,null,null,null,null,null,null,null,null,null,null,null,null,null,null,107,"12078600 SCHNEIDER CREEK TRIBUTARY NEAR SHELTON, WA",20,12078600,"WA",3,1.2,55.3,77.900000000000006,92.8,112,126,140,155,175]
[null,null,null,null,null,null,null,null,null,null,null,null,null,null,null,null,null,108,"12079000 DESCHUTES RIVER NEAR RAINIER, WA",59,12079000,"WA",3,86.5,3870,5320,6250,7390,8220,9020,9830,10900]
[null,null,null,null,null,null,null,null,null,null,null,null,null,null,null,null,null,110,"12080010 DESCHUTES RIVER AT E ST BRIDGE AT TUMWATER, WA       ",24,12080010,"WA",3,155.11223871000001,4230,5980,7060,8410,9400,10400,11300,12600]
[null,null,null,null,null,null,null,null,null,null,null,null,null,null,null,null,null,112,"12081300 EATON CREEK NEAR YELM, WA",29,12081300,"WA",3,2.12,30.4,41.1,48.1,56.8,63.4,70.099999999999994,76.900000000000006,86.1]
[null,null,null,null,null,null,null,null,null,null,null,null,null,null,null,null,null,113,"12082500 NISQUALLY RIVER NEAR NATIONAL, WA              ",72,12082500,"WA",3,135.13434362999999,6430,10000,12600,16000,18600,21400,24100,28000]
[null,null,null,null,null,null,null,null,null,null,null,null,null,null,null,null,null,114,"12083000 MINERAL CREEK NEAR MINERAL, WA               ",72,12083000,"WA",3,76.751506259999999,4680,6720,8000,9500,10600,11600,12500,13800]
[null,null,null,null,null,null,null,null,null,null,null,null,null,null,null,null,null,115,"12084000 NISQUALLY RIVER NEAR ALDER, WA",13,12084000,"WA",3,251.22,10000,14500,17600,21700,24900,28300,31800,36500]
[null,null,null,null,null,null,null,null,null,null,null,null,null,null,null,null,null,116,"12084500 LITTLE NISQUALLY RIVER NEAR ALDER, WA",23,12084500,"WA",3,27.79,1870,2340,2620,2960,3200,3430,3660,3960]
[null,null,null,null,null,null,null,null,null,null,null,null,null,null,null,null,null,117,"12087000 MASHEL RIVER NEAR LA GRANDE, WA               ",39,12087000,"WA",3,82.492388550000001,3070,4450,5360,6500,7350,8200,9050,10200]
[null,null,null,null,null,null,null,null,null,null,null,null,null,null,null,null,null,118,"12088000 OHOP CREEK NEAR EATONVILLE, WA               ",59,12088000,"WA",3,34.342788050999999,660,1020,1280,1660,1970,2300,2650,3160]
[null,null,null,null,null,null,null,null,null,null,null,null,null,null,null,null,null,119,"12090200 MUCK CREEK AT ROY, WA",40,12090200,"WA",3,87.26,465,702,882,1140,1340,1580,1820,2180]
[null,null,null,null,null,null,null,null,null,null,null,null,null,null,null,null,null,125,"12091700 JUDD CREEK NEAR BURTON, WA",11,12091700,"WA",3,4.21,91.7,123,144,172,193,216,238,270]
[null,null,null,null,null,null,null,null,null,null,null,null,null,null,null,null,null,126,"12092000 PUYALLUP RIVER NEAR ELECTRON, WA              ",77,12092000,"WA",3,93.004308540000011,4390,6810,8570,11000,12900,14800,16900,19700]
[null,null,null,null,null,null,null,null,null,null,null,null,null,null,null,null,null,127,"12093000 KAPOWSIN CREEK NEAR KAPOWSIN, WA",34,12093000,"WA",3,24.74,345,502,609,749,856,969,1080,1240]
[null,null,null,null,null,null,null,null,null,null,null,null,null,null,null,null,null,128,"12093500 PUYALLUP RIVER NEAR ORTING, WA               ",83,12093500,"WA",3,169.14562236,6780,10100,12300,15200,17300,19400,21600,24400]
[null,null,null,null,null,null,null,null,null,null,null,null,null,null,null,null,null,129,"12093900 CARBON RIVER AT FAIRFAX, WA",13,12093900,"WA",3,76.5,4340,7030,8900,11300,13000,14800,16500,18900]
[null,null,null,null,null,null,null,null,null,null,null,null,null,null,null,null,null,130,"12094000 CARBON RIVER NEAR FAIRFAX, WA                ",73,12094000,"WA",3,79.237102230000005,4460,6990,8790,11100,12900,14800,16600,19100]
[null,null,null,null,null,null,null,null,null,null,null,null,null,null,null,null,null,131,"12095000 SOUTH PRAIRIE CREEK AT SOUTH PRAIRIE, WA          ",57,12095000,"WA",3,79.473047940000001,2890,4430,5520,6930,8010,9100,10200,11700]
[null,null,null,null,null,null,null,null,null,null,null,null,null,null,null,null,null,133,"12096800 DRY CREEK NEAR GREENWATER, WA",19,12096800,"WA",3,1.01,21.9,35.6,46.3,61.6,74,87.9,102,122]
[null,null,null,null,null,null,null,null,null,null,null,null,null,null,null,null,null,134,"12096950 JIM CREEK NEAR GREENWATER, WA",11,12096950,"WA",3,4.42,168,226,265,315,353,394,434,490]
[null,null,null,null,null,null,null,null,null,null,null,null,null,null,null,null,null,135,"12097000 WHITE RIVER AT GREENWATER, WA                ",48,12097000,"WA",3,215.21167668000001,4870,7930,10400,13900,16900,20200,23600,28600]
[null,null,null,null,null,null,null,null,null,null,null,null,null,null,null,null,null,136,"12097500 GREENWATER RIVER AT GREENWATER, WA             ",72,12097500,"WA",3,73.432629269999993,1460,2620,3630,5180,6510,7980,9590,11900]
[null,null,null,null,null,null,null,null,null,null,null,null,null,null,null,null,null,137,"12097700 CYCLONE CREEK NEAR ENUMCLAW, WA",23,12097700,"WA",3,2.46,170,312,423,574,690,804,920,1080]
[null,null,null,null,null,null,null,null,null,null,null,null,null,null,null,null,null,138,"12097850 WHITE RIVER BELOW CLEARWATER RIVER NR BUCKLEY, WA",22,12097850,"WA",3,374.66093807999999,12700,18200,22000,26800,30400,34200,37900,43100]
[null,null,null,null,null,null,null,null,null,null,null,null,null,null,null,null,null,139,"12099600 BOISE CREEK AT BUCKLEY, WA                 ",37,12099600,"WA",3,16.095389310000002,449,701,889,1150,1350,1570,1800,2120]
[null,null,null,null,null,null,null,null,null,null,null,null,null,null,null,null,null,140,"12100000 WHITE RIVER AT BUCKLEY, WA",44,12100000,"WA",3,426.84,11400,16400,19700,23900,27100,30400,33700,38200]
[null,null,null,null,null,null,null,null,null,null,null,null,null,null,null,null,null,147,"12103400 GREEN RIVER BELOW INTAKE CREEK NEAR LESTER, WA",11,12103400,"WA",3,34.78,1230,2110,2790,3700,4410,5140,5890,6920]
[null,null,null,null,null,null,null,null,null,null,null,null,null,null,null,null,null,148,"12103500 SNOW CREEK NEAR LESTER, WA",20,12103500,"WA",3,11.47,869,1400,1770,2260,2630,3000,3370,3870]
[null,null,null,null,null,null,null,null,null,null,null,null,null,null,null,null,null,149,"12104000 FRIDAY CREEK NEAR LESTER, WA                ",32,12104000,"WA",3,4.7543581800000005,281,479,642,877,1070,1270,1480,1780]
[null,null,null,null,null,null,null,null,null,null,null,null,null,null,null,null,null,150,"12104500 GREEN RIVER NEAR LESTER, WA                 ",46,12104500,"WA",3,96.196351679999992,4570,8050,10800,14600,17500,20500,23600,27800]
[null,null,null,null,null,null,null,null,null,null,null,null,null,null,null,null,null,151,"12104700 GREEN CANYON CREEK NEAR LESTER, WA",13,12104700,"WA",3,3.25,174,259,319,398,458,521,585,672]
[null,null,null,null,null,null,null,null,null,null,null,null,null,null,null,null,null,152,"12105000 SMAY CREEK NEAR LESTER, WA",24,12105000,"WA",3,8.59,476,780,1010,1340,1610,1880,2170,2570]
[null,null,null,null,null,null,null,null,null,null,null,null,null,null,null,null,null,153,"12105710 NORTH FORK GREEN RIVER NEAR LEMOLO, WA           ",31,12105710,"WA",3,16.59,1090,1680,2070,2560,2900,3250,3590,4030]
[null,null,null,null,null,null,null,null,null,null,null,null,null,null,null,null,null,154,"12106000 BEAR CREEK NEAR EABLE GORGE, WA",10,12106000,"WA",3,4.0599999999999996,400,612,758,944,1080,1220,1360,1560]
[null,null,null,null,null,null,null,null,null,null,null,null,null,null,null,null,null,155,"12106500 GREEN RIVER NEAR PALMER, WA",33,12106500,"WA",3,227.85,11500,16800,20400,24800,28100,31400,34700,39200]
[null,null,null,null,null,null,null,null,null,null,null,null,null,null,null,null,null,156,"12107200 DEEP CREEK NEAR CUMBERLAND, WA",21,12107200,"WA",3,2.23,65.5,93.8,113,137,155,174,193,220]
[null,null,null,null,null,null,null,null,null,null,null,null,null,null,null,null,null,160,"12113000 GREEN RIVER NEAR AUBURN, WA",78,12113000,"WA",3,411.84,11700,17100,20800,25500,29000,32600,36300,41200]
[null,null,null,null,null,null,null,null,null,null,null,null,null,null,null,null,null,166,"12113500 NORTH FORK CEDAR RIVER NEAR LESTER, WA",19,12113500,"WA",3,9.5399999999999991,826,1370,1780,2330,2760,3190,3640,4250]
[null,null,null,null,null,null,null,null,null,null,null,null,null,null,null,null,null,167,"12114000 SOUTH FORK CEDAR RIVER NEAR LESTER, WA        ",39,12114000,"WA",3,6.5783331900000004,455,744,973,1300,1570,1850,2150,2570]
[null,null,null,null,null,null,null,null,null,null,null,null,null,null,null,null,null,168,"12114500 CEDAR RIVER BELOW BEAR CREEK NEAR CEDAR FALLS, WA     ",58,12114500,"WA",3,25.697232989999996,1680,2740,3540,4640,5510,6420,7370,8690]
[null,null,null,null,null,null,null,null,null,null,null,null,null,null,null,null,null,169,"12115000 CEDAR RIVER NEAR CEDAR FALLS, WA              ",68,12115000,"WA",3,39.690423629999998,2770,4340,5430,6840,7890,8950,10000,11400]
[null,null,null,null,null,null,null,null,null,null,null,null,null,null,null,null,null,170,"12115300 GREEN POINT CREEK NEAR CEDAR FALLS, WA",32,12115300,"WA",3,0.75,85.6,109,123,139,151,163,174,189]
[null,null,null,null,null,null,null,null,null,null,null,null,null,null,null,null,null,171,"12115500 REX RIVER NEAR CEDAR FALLS, WA               ",68,12115500,"WA",3,13.404774240000002,1610,2480,3070,3810,4350,4880,5400,6080]
[null,null,null,null,null,null,null,null,null,null,null,null,null,null,null,null,null,172,"12115700 BOULDER CREEK NEAR CEDAR FALLS, WA             ",31,12115700,"WA",3,5.0684891399999996,483,867,1160,1570,1880,2180,2490,2900]
[null,null,null,null,null,null,null,null,null,null,null,null,null,null,null,null,null,173,"12115800 RACK CREEK NEAR CEDAR FALLS, WA",10,12115800,"WA",3,2.1800000000000002,169,290,384,511,609,711,814,955]
[null,null,null,null,null,null,null,null,null,null,null,null,null,null,null,null,null,174,"12117000 TAYLOR CREEK NEAR SELLECK, WA                ",58,12117000,"WA",3,17.317986543,843,1320,1680,2180,2580,3010,3460,4100]
[null,null,null,null,null,null,null,null,null,null,null,null,null,null,null,null,null,182,"12120600 ISSAQUAH CREEK NEAR HOBART, WA               ",29,12120600,"WA",3,18.09102438,618,984,1240,1590,1850,2120,2390,2760]
[null,null,null,null,null,null,null,null,null,null,null,null,null,null,null,null,null,183,"12121000 ISSAQUAH CREEK NEAR ISSAQUAH, WA",19,12121000,"WA",3,29.01,682,1050,1330,1720,2040,2390,2760,3280]
[null,null,null,null,null,null,null,null,null,null,null,null,null,null,null,null,null,185,"12121700 TIBBETTS CREEK NEAR ISSAQUAH, WA",11,12121700,"WA",3,3.96,146,232,291,366,422,477,534,610]
[null,null,null,null,null,null,null,null,null,null,null,null,null,null,null,null,null,198,"12130500 SOUTH FORK SKYKOMISH RIVER NEAR SKYKOMISH, WA",26,12130500,"WA",3,136.01,6520,10000,12600,16100,18800,21600,24500,28600]
[null,null,null,null,null,null,null,null,null,null,null,null,null,null,null,null,null,199,"12131000 BECKLER RIVER NEAR SKYKOMISH, WA",28,12131000,"WA",3,96.67,5630,8420,10400,13100,15200,17300,19600,22600]
[null,null,null,null,null,null,null,null,null,null,null,null,null,null,null,null,null,200,"12132700 SOUTH FORK SKYKOMISH RIVER TRIBUTARY AT BARING, WA",20,12132700,"WA",3,0.9,107,154,184,222,250,279,306,343]
[null,null,null,null,null,null,null,null,null,null,null,null,null,null,null,null,null,201,"12133000 SOUTH FORK SKYKOMISH RIVER NEAR INDEX, WA          ",74,12133000,"WA",3,357.36983567999999,23200,35300,43800,55100,63700,72500,81600,93900]
[null,null,null,null,null,null,null,null,null,null,null,null,null,null,null,null,null,202,"12133500 TROUBLESOME CREEK NEAR INDEX, WA",12,12133500,"WA",3,12.96,1010,1640,2130,2790,3310,3860,4420,5180]
[null,null,null,null,null,null,null,null,null,null,null,null,null,null,null,null,null,203,"12134000 NORTH FORK SKYKOMISH RIVER AT INDEX, WA",21,12134000,"WA",3,145.68,13600,19900,24200,29700,33700,37800,41900,47500]
[null,null,null,null,null,null,null,null,null,null,null,null,null,null,null,null,null,204,"12134500 SKYKOMISH RIVER NEAR GOLD BAR, WA              ",86,12134500,"WA",3,535.19483159999993,40600,61300,75600,93900,108000,121000,135000,154000]
[null,null,null,null,null,null,null,null,null,null,null,null,null,null,null,null,null,205,"12135000 WALLACE RIVER AT GOLD BAR, WA                ",44,12135000,"WA",3,19.21133214,2010,2670,3110,3650,4060,4470,4890,5460]
[null,null,null,null,null,null,null,null,null,null,null,null,null,null,null,null,null,206,"12135500 OLNEY CREEK NEAR GOLD BAR, WA",21,12135500,"WA",3,7.69,988,1570,2020,2630,3120,3610,4130,4830]
[null,null,null,null,null,null,null,null,null,null,null,null,null,null,null,null,null,207,"12137290 SOUTH FORK SULTAN RIVER NEAR SULTAN, WA           ",24,12137290,"WA",3,11.746899449999999,2620,4350,5590,7200,8390,9500,10600,12100]
[null,null,null,null,null,null,null,null,null,null,null,null,null,null,null,null,null,208,"12137500 SULTAN RIVER NEAR STARTUP, WA",38,12137500,"WA",3,74.332628370000009,15100,22400,27200,32900,37100,40900,44700,49700]
[null,null,null,null,null,null,null,null,null,null,null,null,null,null,null,null,null,209,"12141000 WOODS CREEK NEAR MONROE, WA                 ",32,12141000,"WA",3,56.727742500000005,1300,1810,2140,2550,2860,3180,3500,3930]
[null,null,null,null,null,null,null,null,null,null,null,null,null,null,null,null,null,210,"12141100 SKYKOMISH RIVER AT MONROE, WA",19,12141100,"WA",3,767.16,52900,71400,82400,95200,104000,112000,120000,131000]
[null,null,null,null,null,null,null,null,null,null,null,null,null,null,null,null,null,211,"12141300 MIDDLE FORK SNOQUALMIE RIVER NEAR TANNER, WA        ",54,12141300,"WA",3,155.02293377999999,16300,22800,26800,31400,34600,37600,40500,44200]
[null,null,null,null,null,null,null,null,null,null,null,null,null,null,null,null,null,212,"12141500 MIDDLE FORK SNOQUALMIE RIVER NEAR NORTH BEND, WA",20,12141500,"WA",3,168.53,12600,19100,23600,29600,34200,38900,43700,50300]
[null,null,null,null,null,null,null,null,null,null,null,null,null,null,null,null,null,213,"12142000 NF SNOQUALMIE RIVER NEAR SNOQUALMIE FALLS, WA        ",83,12142000,"WA",3,63.955881990000002,2170,3120,3830,4810,5580,6450,7330,8560]
[null,null,null,null,null,null,null,null,null,null,null,null,null,null,null,null,null,214,"12142300 HANCOCK CREEK NEAR SNOQUALMIE, WA",15,12142300,"WA",3,7.4,466,659,796,980,1120,1280,1430,1650]
[null,null,null,null,null,null,null,null,null,null,null,null,null,null,null,null,null,215,"12143000 NORTH FORK SNOQUALMIE RIVER NEAR NORTH BEND, WA",43,12143000,"WA",3,95.8,8860,12300,14600,17300,19300,21200,23200,25800]
[null,null,null,null,null,null,null,null,null,null,null,null,null,null,null,null,null,216,"12143300 SF SNOQUALMIE RIVER TRIBUTARY NEAR NORTH BEND, WA",20,12143300,"WA",3,0.31,27,33.299999999999997,37.299999999999997,42,45.4,48.9,52.2,56.7]
[null,null,null,null,null,null,null,null,null,null,null,null,null,null,null,null,null,217,"12143310 SF SNOQUALMIE RIVER TRIB NO 9 NEAR NORTH BEND, WA",11,12143310,"WA",3,0.31,18.8,27.6,33.9,42.2,48.6,55.5,62.4,71.900000000000006]
[null,null,null,null,null,null,null,null,null,null,null,null,null,null,null,null,null,218,"12143400 SF SNOQUALMIE RIVER AB ALICE CREEK NEAR GARCIA, WA",54,12143400,"WA",3,41.65883865,3760,5680,6950,8550,9720,10900,12000,13500]
[null,null,null,null,null,null,null,null,null,null,null,null,null,null,null,null,null,219,"12143600 SF SNOQUALMIE RIVER AT EDGEWICK, WA             ",33,12143600,"WA",3,63.709164090000002,5840,8830,10900,13400,15300,17100,19000,21500]
[null,null,null,null,null,null,null,null,null,null,null,null,null,null,null,null,null,220,"12143700 BOXLEY CREEK NEAR CEDAR FALLS, WA",69,12143700,"WA",3,1.31,78,117,144,179,205,231,258,294]
[null,null,null,null,null,null,null,null,null,null,null,null,null,null,null,null,null,221,"12143900 BOXLEY CREEK NEAR EDGEWICK, WA               ",33,12143900,"WA",3,5.4180640799999997,122,164,194,234,266,301,337,389]
[null,null,null,null,null,null,null,null,null,null,null,null,null,null,null,null,null,223,"12144500 SNOQUALMIE RIVER NEAR SNOQUALMIE, WA            ",56,12144500,"WA",3,377.16807842999998,29800,43300,52100,63000,71000,78800,86600,96800]
[null,null,null,null,null,null,null,null,null,null,null,null,null,null,null,null,null,224,"12145500 RAGING RIVER NEAR FALL CITY, WA               ",68,12145500,"WA",3,30.494332440000001,1930,2850,3500,4350,5020,5690,6400,7360]
[null,null,null,null,null,null,null,null,null,null,null,null,null,null,null,null,null,226,"12147000 GRIFFIN CREEK NEAR CARNATION, WA              ",33,12147000,"WA",3,17.198670060000001,404,584,731,944,1120,1320,1540,1850]
[null,null,null,null,null,null,null,null,null,null,null,null,null,null,null,null,null,227,"12147500 NORTH FORK TOLT RIVER NEAR CARNATION, WA          ",59,12147500,"WA",3,39.72714174,4720,6500,7640,9070,10100,11100,12200,13500]
[null,null,null,null,null,null,null,null,null,null,null,null,null,null,null,null,null,228,"12147600 SOUTH FORK TOLT RIVER NEAR INDEX, WA            ",51,12147600,"WA",3,5.4542030400000003,1160,1670,1990,2370,2640,2900,3160,3480]
[null,null,null,null,null,null,null,null,null,null,null,null,null,null,null,null,null,229,"12148000 SOUTH FORK TOLT RIVER NEAR CARNATION, WA",56,12148000,"WA",3,20.010000000000002,3300,4580,5420,6480,7260,8050,8840,9910]
[null,null,null,null,null,null,null,null,null,null,null,null,null,null,null,null,null,230,"12148100 SOUTH FORK TOLT RIVER TRIBUTARY NEAR CARNATION, WA",20,12148100,"WA",3,2.82,129,186,226,279,320,364,408,470]
[null,null,null,null,null,null,null,null,null,null,null,null,null,null,null,null,null,231,"12148500 TOLT RIVER NEAR CARNATION, WA                ",79,12148500,"WA",3,81.157679459999997,6460,9580,11700,14500,16500,18600,20700,23600]
[null,null,null,null,null,null,null,null,null,null,null,null,null,null,null,null,null,232,"12149000 SNOQUALMIE RIVER NEAR CARNATION, WA             ",85,12149000,"WA",3,602.86194539999997,30200,45600,55800,68400,77600,86700,95600,107000]
[null,null,null,null,null,null,null,null,null,null,null,null,null,null,null,null,null,233,"12150800 SNOHOMISH RIVER NEAR MONROE, WA               ",51,12150800,"WA",3,1536.1393905,61700,84200,99500,119000,135000,150000,166000,189000]
[null,null,null,null,null,null,null,null,null,null,null,null,null,null,null,null,null,234,"12152500 PILCHUCK RIVER NEAR GRANITE FALLS, WA",37,12152500,"WA",3,54.71,5070,6700,7720,8960,9850,10700,11600,12700]
[null,null,null,null,null,null,null,null,null,null,null,null,null,null,null,null,null,235,"12153000 LITTLE PILCHUCK C NEAR LAKE STEVENS, WA           ",27,12153000,"WA",3,16.88523408,268,383,461,562,639,720,802,915]
[null,null,null,null,null,null,null,null,null,null,null,null,null,null,null,null,null,236,"12155300 PILCHUCK RIVER NEAR SNOHOMISH, WA              ",22,12155300,"WA",3,128.74087512,5820,8540,10300,12600,14200,15800,17500,19700]
[null,null,null,null,null,null,null,null,null,null,null,null,null,null,null,null,null,240,"12157250 MISSION CREEK NEAR TULALIP, WA",17,12157250,"WA",3,8.0299999999999994,63.2,89.3,108,133,152,174,196,227]
[null,null,null,null,null,null,null,null,null,null,null,null,null,null,null,null,null,242,"12158032 EAST BRANCH TULALIP CREEK NR MOUTH NR TULALIP, WA",13,12158032,"WA",3,2.06,25.2,34.200000000000003,40.299999999999997,48.3,54.5,61.2,67.8,77]
[null,null,null,null,null,null,null,null,null,null,null,null,null,null,null,null,null,243,"12158040 TULALIP CREEK NEAR TULALIP, WA",17,12158040,"WA",3,15.64,92.9,131,158,195,224,256,290,337]
[null,null,null,null,null,null,null,null,null,null,null,null,null,null,null,null,null,244,"12161000 SF STILLAGUAMISH RIVER NEAR GRANITE FALLS, WA        ",52,12161000,"WA",3,117.29038464,16000,21100,24100,27700,30200,32600,34900,37900]
[null,null,null,null,null,null,null,null,null,null,null,null,null,null,null,null,null,245,"12162500 SF STILLAGUAMISH RIVER AB JIM CR NR ARLINGTON, WA",20,12162500,"WA",3,197.71,20000,23600,25700,28200,29900,31500,33000,35100]
[null,null,null,null,null,null,null,null,null,null,null,null,null,null,null,null,null,246,"12164000 JIM CREEK NEAR ARLINGTON, WA",31,12164000,"WA",3,46.15,2770,3610,4130,4760,5210,5650,6090,6670]
[null,null,null,null,null,null,null,null,null,null,null,null,null,null,null,null,null,247,"12165000 SQUIRE CREEK NEAR DARRINGTON, WA",19,12165000,"WA",3,19.829999999999998,2920,3980,4670,5510,6130,6750,7360,8180]
[null,null,null,null,null,null,null,null,null,null,null,null,null,null,null,null,null,248,"12166500 DEER CREEK AT OSO, WA",13,12166500,"WA",3,65.89,7320,8630,9410,10300,11000,11700,12300,13200]
[null,null,null,null,null,null,null,null,null,null,null,null,null,null,null,null,null,249,"12167000 NF STILLAGUAMISH RIVER NEAR ARLINGTON, WA          ",86,12167000,"WA",3,263.99684025000005,23900,31500,36200,41500,45300,48800,52200,56600]
[null,null,null,null,null,null,null,null,null,null,null,null,null,null,null,null,null,250,"12168500 PILCHUCK CREEK NEAR BRYANT, WA",31,12168500,"WA",3,52.64,4130,5370,6140,7090,7770,8440,9120,10000]
[null,null,null,null,null,null,null,null,null,null,null,null,null,null,null,null,null,251,"12169500 FISH CREEK NEAR ARLINGTON, WA",21,12169500,"WA",3,8.1199999999999992,93.4,139,171,214,247,283,319,369]
[null,null,null,null,null,null,null,null,null,null,null,null,null,null,null,null,null,252,"12172000 BIG BEAVER CREEK NEAR NEWHALEM, WA",15,12172000,"WA",3,63.7,2470,3560,4340,5340,6130,6970,7800,8980]
[null,null,null,null,null,null,null,null,null,null,null,null,null,null,null,null,null,254,"12173500 RUBY CREEK BELOW PANTHER CREEK NEAR NEWHALEM, WA",15,12173500,"WA",3,207.9,4730,6210,7180,8410,9350,10300,11300,12600]
[null,null,null,null,null,null,null,null,null,null,null,null,null,null,null,null,null,255,"12174000 RUBY CREEK NEAR NEWHALEM, WA",21,12174000,"WA",3,212.85,4250,5740,6750,8050,9050,10100,11200,12600]
[null,null,null,null,null,null,null,null,null,null,null,null,null,null,null,null,null,257,"12175500 THUNDER CREEK NEAR NEWHALEM, WA               ",84,12175500,"WA",3,105.72209504999999,4230,6570,8430,11100,13400,15900,18600,22500]
[null,null,null,null,null,null,null,null,null,null,null,null,null,null,null,null,null,258,"12176000 THUNDER CREEK NEAR MARBLEMOUNT, WA",11,12176000,"WA",3,115.32,5120,8250,10600,13700,16200,18600,21200,24800]
[null,null,null,null,null,null,null,null,null,null,null,null,null,null,null,null,null,259,"12177500 STETATTLE CREEK NEAR NEWHALEM, WA              ",50,12177500,"WA",3,22.539938850000002,2050,3440,4560,6150,7430,8730,10100,12000]
[null,null,null,null,null,null,null,null,null,null,null,null,null,null,null,null,null,260,"12178100 NEWHALEM CREEK NEAR NEWHALEM, WA              ",54,12178100,"WA",3,26.904760740000004,1940,3080,3950,5150,6110,7120,8170,9640]
[null,null,null,null,null,null,null,null,null,null,null,null,null,null,null,null,null,261,"12179900 BACON CREEK BELOW OAKES CREEK NR MARBLEMOUNT, WA",16,12179900,"WA",3,49.55,4880,7980,10100,12700,14700,16500,18300,20800]
[null,null,null,null,null,null,null,null,null,null,null,null,null,null,null,null,null,262,"12181100 SF CASCADE R AT S CASCADE GL NR MARBLEMOUNT, WA",23,12181100,"WA",3,2.54,138,170,192,220,241,264,287,319]
[null,null,null,null,null,null,null,null,null,null,null,null,null,null,null,null,null,263,"12181200 SALIX CREEK AT S CASCADE GL NEAR MARBLEMOUNT, WA",30,12181200,"WA",3,0.08,11.5,17.600000000000001,21.9,27.7,32,36.4,40.9,47]
[null,null,null,null,null,null,null,null,null,null,null,null,null,null,null,null,null,264,"12182500 CASCADE RIVER AT MARBLEMOUNT, WA              ",65,12182500,"WA",3,171.52662383999998,7710,12700,16700,22400,27100,32100,37400,45000]
[null,null,null,null,null,null,null,null,null,null,null,null,null,null,null,null,null,265,"12184300 IRON CREEK NEAR ROCKPORT, WA",11,12184300,"WA",3,1.99,199,253,286,325,353,381,407,442]
[null,null,null,null,null,null,null,null,null,null,null,null,null,null,null,null,null,266,"12185300 ELLIOTT CR AT GOAT LAKE OUTLET NR MONTE CRISTO, WA",11,12185300,"WA",3,3.04,437,841,1140,1500,1760,1990,2230,2540]
[null,null,null,null,null,null,null,null,null,null,null,null,null,null,null,null,null,267,"12186000 SAUK RIVER AB WHITECHUCK RIVER NEAR DARRINGTON",91,12186000,"WA",3,153.83590794,9610,15500,20300,27400,33400,40000,47100,57400]
[null,null,null,null,null,null,null,null,null,null,null,null,null,null,null,null,null,268,"12187500 SAUK RIVER AT DARRINGTON, WA",22,12187500,"WA",3,295.13,16700,24700,30400,37900,43700,49800,56000,64500]
[null,null,null,null,null,null,null,null,null,null,null,null,null,null,null,null,null,269,"12188300 STRAIGHT CREEK NEAR DARRINGTON, WA",11,12188300,"WA",3,4.12,302,396,457,534,591,651,709,787]
[null,null,null,null,null,null,null,null,null,null,null,null,null,null,null,null,null,270,"12189000 SUIATTLE RIVER NEAR MANSFORD, WA",12,12189000,"WA",3,335.41,11000,17300,22200,28900,34200,40100,46100,54500]
[null,null,null,null,null,null,null,null,null,null,null,null,null,null,null,null,null,271,"12189400 SAUK RIVER TRIBUTARY NEAR DARRINGTON, WA",31,12189400,"WA",3,1.26,106,150,178,214,239,264,289,323]
[null,null,null,null,null,null,null,null,null,null,null,null,null,null,null,null,null,272,"12189500 SAUK RIVER NEAR SAUK, WA                  ",87,12189500,"WA",3,716.3378937,31100,48000,60400,77300,90600,104000,119000,139000]
[null,null,null,null,null,null,null,null,null,null,null,null,null,null,null,null,null,273,"12191500 BAKER RIVER BELOW ANDERSON CREEK NEAR CONCRETE, WA",24,12191500,"WA",3,210.65,15700,23200,28400,35200,40200,45400,50600,57600]
[null,null,null,null,null,null,null,null,null,null,null,null,null,null,null,null,null,274,"12191800 SULPHER CREEK NEAR CONCRETE, WA",14,12191800,"WA",3,8.19,469,725,926,1210,1440,1700,1960,2330]
[null,null,null,null,null,null,null,null,null,null,null,null,null,null,null,null,null,275,"12196000 ALDER CREEK NEAR HAMILTON, WA                ",36,12196000,"WA",3,11.068251479999999,325,486,601,753,872,999,1130,1310]
[null,null,null,null,null,null,null,null,null,null,null,null,null,null,null,null,null,276,"12196200 DAY CREEK BELOW DAY LAKE NEAR LYMAN, WA",16,12196200,"WA",3,6.66,561,728,836,971,1070,1180,1280,1420]
[null,null,null,null,null,null,null,null,null,null,null,null,null,null,null,null,null,277,"12196500 DAY CREEK NEAR LYMAN, WA",18,12196500,"WA",3,34,4370,5080,5490,5970,6290,6610,6910,7310]
[null,null,null,null,null,null,null,null,null,null,null,null,null,null,null,null,null,278,"12197200 PARKER CREEK NEAR LYMAN, WA",20,12197200,"WA",3,1.68,135,169,189,214,231,249,266,289]
[null,null,null,null,null,null,null,null,null,null,null,null,null,null,null,null,null,279,"12197700 WISEMAN CREEK NEAR LYMAN, WA",10,12197700,"WA",3,3.38,359,676,892,1150,1340,1490,1660,1880]
[null,null,null,null,null,null,null,null,null,null,null,null,null,null,null,null,null,280,"12199000 SKAGIT RIVER NEAR SEDRO WOOLLEY, WA",24,12199000,"WA",3,2605.19,107000,161000,199000,249000,286000,325000,365000,419000]
[null,null,null,null,null,null,null,null,null,null,null,null,null,null,null,null,null,281,"12199800 EAST FORK NOOKACHAMPS CREEK NEAR BIG LAKE, WA",16,12199800,"WA",3,3.96,508,597,649,709,751,792,832,883]
[null,null,null,null,null,null,null,null,null,null,null,null,null,null,null,null,null,283,"12200800 LAKE CREEK NEAR BELLINGHAM, WA",19,12200800,"WA",3,2.4700000000000002,115,173,213,265,304,342,382,436]
[null,null,null,null,null,null,null,null,null,null,null,null,null,null,null,null,null,284,"12201500 SAMISH RIVER NEAR BURLINGTON, WA              ",58,12201500,"WA",3,86.551071749999991,2620,4200,5370,6970,8220,9520,10900,12700]
[null,null,null,null,null,null,null,null,null,null,null,null,null,null,null,null,null,285,"12201950 ANDERSON CREEK NEAR BELLINGHAM, WA",17,12201950,"WA",3,4.0999999999999996,157,217,257,309,349,391,433,490]
[null,null,null,null,null,null,null,null,null,null,null,null,null,null,null,null,null,286,"12201960 BRANNIAN CREEK AT S BAY DR NR WICKERSHAM, WA",13,12201960,"WA",3,3.46,173,335,451,595,699,789,884,1010]
[null,null,null,null,null,null,null,null,null,null,null,null,null,null,null,null,null,287,"12202300 OLSEN CREEK NEAR BELLINGHAM, WA",20,12202300,"WA",3,3.9,226,375,485,635,751,870,992,1160]
[null,null,null,null,null,null,null,null,null,null,null,null,null,null,null,null,null,288,"12202310 CARPENTER CREEK NEAR BELLINGHAM",13,12202310,"WA",3,1.27,30.7,53.7,72.099999999999994,98.2,119,141,164,196]
[null,null,null,null,null,null,null,null,null,null,null,null,null,null,null,null,null,292,"12204400 NOOKSACK RIVER TRIBUTARY NEAR GLACIER, WA",32,12204400,"WA",3,0.93,53.6,80.5,101,129,152,177,203,240]
[null,null,null,null,null,null,null,null,null,null,null,null,null,null,null,null,null,293,"12205000 NF NOOKSACK RIVER BL CASCADE CREEK NR GLACIER, WA    ",77,12205000,"WA",3,105.20537741999999,6030,8140,9530,11300,12600,13900,15200,17000]
[null,null,null,null,null,null,null,null,null,null,null,null,null,null,null,null,null,294,"12206900 RACEHORSE CREEK AT NORTH FORK ROAD  NR KENDALL, WA",13,12206900,"WA",3,10.47,1350,1490,1560,1650,1710,1770,1820,1900]
[null,null,null,null,null,null,null,null,null,null,null,null,null,null,null,null,null,295,"12207200 NF NOOKSACK RIVER NEAR DEMING, WA",11,12207200,"WA",3,277.02,9820,12500,14300,16600,18300,20100,21900,24300]
[null,null,null,null,null,null,null,null,null,null,null,null,null,null,null,null,null,296,"12207750 WARM CREEK NEAR WELCOME, WA",11,12207750,"WA",3,4.37,354,450,511,586,640,696,751,824]
[null,null,null,null,null,null,null,null,null,null,null,null,null,null,null,null,null,297,"12207850 CLEARWATER CREEK NEAR WELCOME, WA",12,12207850,"WA",3,18.86,1930,3140,4000,5110,5940,6750,7570,8690]
[null,null,null,null,null,null,null,null,null,null,null,null,null,null,null,null,null,298,"12208000 MF NOOKSACK RIVER NEAR DEMING, WA              ",36,12208000,"WA",3,74.38961673,6110,9200,11400,14400,16700,19000,21500,24800]
[null,null,null,null,null,null,null,null,null,null,null,null,null,null,null,null,null,299,"12209000 SF NOOKSACK RIVER NEAR WICKERSHAM, WA            ",63,12209000,"WA",3,103.3470009,9960,14000,16700,20000,22300,24600,26900,30000]
[null,null,null,null,null,null,null,null,null,null,null,null,null,null,null,null,null,300,"12209490 SKOOKUM CREEK ABOVE DIVERSION NEAR WICKERSHAM, WA",37,12209490,"WA",3,22.46,1720,2690,3430,4470,5300,6180,7110,8410]
[null,null,null,null,null,null,null,null,null,null,null,null,null,null,null,null,null,301,"12210500 NOOKSACK RIVER AT DEMING, WA                ",72,12210500,"WA",3,579.35501909999994,25600,34800,41000,49100,55200,61600,68000,77000]
[null,null,null,null,null,null,null,null,null,null,null,null,null,null,null,null,null,302,"12210900 ANDERSON CREEK AT SMITH ROAD NEAR GOSHEN, WA",16,12210900,"WA",3,8.91,450,666,812,1000,1140,1280,1430,1630]
[null,null,null,null,null,null,null,null,null,null,null,null,null,null,null,null,null,303,"12211500 NOOKSACK RIVER NEAR LYNDEN, WA",28,12211500,"WA",3,645.65,30100,40100,46300,53800,59200,64500,69700,76700]
[null,null,null,null,null,null,null,null,null,null,null,null,null,null,null,null,null,306,"12212700 TENMILE CREEK TRIBUTARY NEAR BELLINGHAM, WA",19,12212700,"WA",3,0.73,24.3,36.200000000000003,44.3,54.5,62.2,69.900000000000006,77.8,88.5]
[null,null,null,null,null,null,null,null,null,null,null,null,null,null,null,null,null,308,"12213100 NOOKSACK RIVER AT FERNDALE, WA",69,12213100,"WA",3,735.36,25500,34600,40900,49300,56000,63000,70300,80500]
[null,null,null,null,null,null,null,null,null,null,null,null,null,null,null,null,null,313,"12395800 DEER CREEK NEAR KALKENA,WA",20,12395800,"WA",3,4.75,43.3,60.3,71.400000000000006,85.2,95.5,106,116,130]
[null,null,null,null,null,null,null,null,null,null,null,null,null,null,null,null,null,314,"12395900 DAVIS CREEK NEAR DALKENA, WA",20,12395900,"WA",3,18.13,87.1,119,141,168,189,210,231,260]
[null,null,null,null,null,null,null,null,null,null,null,null,null,null,null,null,null,315,"12396000 CALISPELL CREEK NEAR DALKENA, WA              ",54,12396000,"WA",2,68.070858569999999,520,844,1090,1410,1680,1950,2240,2650]
[null,null,null,null,null,null,null,null,null,null,null,null,null,null,null,null,null,316,"12396100 WINCHESTER CREEK NEAR CUSICK, WA",35,12396100,"WA",2,15.95,79.900000000000006,119,148,186,217,250,284,332]
[null,null,null,null,null,null,null,null,null,null,null,null,null,null,null,null,null,317,"12396450 LITTLE MUDDY CREEK AT IONE, WA",20,12396450,"WA",2,11.12,89.8,149,195,259,312,368,429,516]
[null,null,null,null,null,null,null,null,null,null,null,null,null,null,null,null,null,318,"12396900 SULLIVAN CREEK AB OUTLET CR NR METALINE FALLS, WA     ",27,12396900,"WA",2,70.002207990000002,1050,1360,1560,1810,1990,2160,2330,2560]
[null,null,null,null,null,null,null,null,null,null,null,null,null,null,null,null,null,319,"12397500 SULLIVAN CREEK NEAR METALINE FALLS, WA",12,12397500,"WA",2,123.56,1340,1520,1620,1740,1820,1900,1970,2060]
[null,null,null,null,null,null,null,null,null,null,null,null,null,null,null,null,null,320,"12398000 SULLIVAN CREEK AT METALINE FALLS, WA            ",27,12398000,"WA",2,142.91186481,1350,2130,2690,3450,4040,4650,5280,6150]
[null,null,null,null,null,null,null,null,null,null,null,null,null,null,null,null,null,324,"12403700 THIRD CREEK NEAR CURLEW, WA",20,12403700,"WA",2,1.6,11.2,12.8,13.7,14.8,15.6,16.3,17.100000000000001,18]
[null,null,null,null,null,null,null,null,null,null,null,null,null,null,null,null,null,326,"12405400 NANCY CREEK NEAR KETTLE FALLS, WA",20,12405400,"WA",2,11.58,52.9,92.3,124,170,209,252,299,368]
[null,null,null,null,null,null,null,null,null,null,null,null,null,null,null,null,null,327,"12407500 SHEEP CREEK AT SPRINGDALE, WA",20,12407500,"WA",2,54.86,44.7,68.400000000000006,85.1,107,125,143,161,188]
[null,null,null,null,null,null,null,null,null,null,null,null,null,null,null,null,null,328,"12407520 DEER CREEK NEAR VALLEY, WA",20,12407520,"WA",2,41.72,117,212,290,408,510,624,752,946]
[null,null,null,null,null,null,null,null,null,null,null,null,null,null,null,null,null,329,"12407600 THOMASON CREEK NEAR CHEWELAH, WA",20,12407600,"WA",2,4.34,6.11,8.66,10.5,13.2,15.3,17.600000000000001,20.100000000000001,23.7]
[null,null,null,null,null,null,null,null,null,null,null,null,null,null,null,null,null,330,"12407700 CHEWELAH CREEK AT CHEWELAH, WA",18,12407700,"WA",2,92.28,167,264,336,434,513,596,685,810]
[null,null,null,null,null,null,null,null,null,null,null,null,null,null,null,null,null,331,"12408200 PATCHEN (BIGHORN) CREEK NEAR TIGER, WA ",20,12408200,"WA",2,1.1499999999999999,9.07,15.6,20.6,27.5,33,38.799999999999997,44.9,53.5]
[null,null,null,null,null,null,null,null,null,null,null,null,null,null,null,null,null,332,"12408300 LITTLE PEND OREILLE RIVER NEAR COLVILLE, WA",22,12408300,"WA",2,130.66999999999999,307,533,698,918,1090,1260,1440,1690]
[null,null,null,null,null,null,null,null,null,null,null,null,null,null,null,null,null,333,"12408400 NARCISSE CREEK NEAR COLVILLE, WA",20,12408400,"WA",2,12.78,28.9,47.5,61.9,82.7,99.9,119,139,170]
[null,null,null,null,null,null,null,null,null,null,null,null,null,null,null,null,null,334,"12408420 HALLER CREEK NEAR ARDEN, WA",20,12408420,"WA",2,37.549999999999997,43.9,91.1,135,205,270,346,435,574]
[null,null,null,null,null,null,null,null,null,null,null,null,null,null,null,null,null,335,"12408500 MILL CREEK NEAR COLVILLE, WA                ",47,12408500,"WA",2,82.592813160000006,295,455,565,708,815,924,1030,1180]
[null,null,null,null,null,null,null,null,null,null,null,null,null,null,null,null,null,336,"12409000 COLVILLE RIVER AT KETTLE FALLS, WA             ",92,"12409000","WA",2,1004.5460997,1200,1880,2330,2910,3340,3760,4180,4740]
[null,null,null,null,null,null,null,null,null,null,null,null,null,null,null,null,null,337,"12409500 HALL CREEK AT INCHELIUM, WA",20,12409500,"WA",2,167.64,439,735,957,1260,1510,1770,2040,2430]
[null,null,null,null,null,null,null,null,null,null,null,null,null,null,null,null,null,338,"12410000 STRANGER CREEK AT METEOR, WA",13,12410000,"WA",2,49.14,65.400000000000006,167,266,428,577,747,943,1240]
[null,null,null,null,null,null,null,null,null,null,null,null,null,null,null,null,null,339,"12410600 SOUTH FORK HARVEY CREEK NEAR CEDONIA, WA",20,12410600,"WA",2,17.89,22.1,31.5,37.6,45.2,50.9,56.7,62.4,70.2]
[null,null,null,null,null,null,null,null,null,null,null,null,null,null,null,null,null,340,"12410650 NORTH FORK HARVEY CREEK NEAR CEDONIA, WA",20,12410650,"WA",2,6.86,5.92,9.2799999999999994,11.7,15,17.7,20.6,23.6,28]
[null,null,null,null,null,null,null,null,null,null,null,null,null,null,null,null,null,344,"12423550 HANGMAN CREEK TRIBUTARY NEAR LATAH, WA",16,12423550,"WA",2,2.23,51.3,107,157,236,305,386,479,621]
[null,null,null,null,null,null,null,null,null,null,null,null,null,null,null,null,null,345,"12423700 SOUTH FORK ROCK CREEK TRIBUTARY NEAR FAIRFIELD, WA",15,12423700,"WA",2,0.63,24.7,33,38.1,44.4,48.9,53.4,57.7,63.4]
[null,null,null,null,null,null,null,null,null,null,null,null,null,null,null,null,null,346,"12423900 STEVENS CREEK TRIBUTARY NEAR MORAN, WA",20,12423900,"WA",1,2,18.2,45.1,71.7,116,157,207,265,356]
[null,null,null,null,null,null,null,null,null,null,null,null,null,null,null,null,null,347,"12424000 HANGMAN CREEK AT SPOKANE, WA                ",67,"12424000","WA",1,689.28270839999993,5760,9640,12500,16500,19700,23000,26500,31400]
[null,null,null,null,null,null,null,null,null,null,null,null,null,null,null,null,null,348,"12427000 LITTLE SPOKANE RIVER AT ELK, WA",37,12427000,"WA",1,109.8,109,134,150,169,183,197,210,228]
[null,null,null,null,null,null,null,null,null,null,null,null,null,null,null,null,null,349,"12429200 BEAR CREEK NEAR MILAN, WA",13,12429200,"WA",1,9.6,49.9,71.2,86.7,107,123,140,157,182]
[null,null,null,null,null,null,null,null,null,null,null,null,null,null,null,null,null,350,"12429600 DEER CREEK NEAR CHATTAROY, WA",14,12429600,"WA",1,32.950000000000003,139,199,244,307,357,411,469,551]
[null,null,null,null,null,null,null,null,null,null,null,null,null,null,null,null,null,351,"12429800 MUD CREEK NEAR DEER PARK, WA",20,12429800,"WA",1,1.88,12.2,19.100000000000001,24.2,31.4,37.1,43.2,49.7,58.9]
[null,null,null,null,null,null,null,null,null,null,null,null,null,null,null,null,null,352,"12430370 BIGELOW GULCH NEAR SPOKANE, WA",15,12430370,"WA",1,1.75,26.9,82.5,145,263,381,541,742,1090]
[null,null,null,null,null,null,null,null,null,null,null,null,null,null,null,null,null,353,"12431000 LITTLE SPOKANE RIVER AT DARTFORD, WA            ",72,12431000,"WA",1,672.81,1280,1990,2470,3070,3520,3970,4420,5010]
[null,null,null,null,null,null,null,null,null,null,null,null,null,null,null,null,null,354,"12431100 LITTLE CREEK AT DARTFORD, WA",15,12431100,"WA",1,11.58,43,136,244,446,642,898,1210,1740]
[null,null,null,null,null,null,null,null,null,null,null,null,null,null,null,null,null,356,"12433200 CHAMOKANE CREEK BELOW FALLS NEAR LONG LAKE, WA       ",35,12433200,"WA",1,180.94568778000001,490,1020,1450,2100,2630,3210,3840,4750]
[null,null,null,null,null,null,null,null,null,null,null,null,null,null,null,null,null,357,"12433300 SPRING CREEK TRIBUTARY NEAR REARDAN, WA",20,12433300,"WA",1,1.07,46.8,74.599999999999994,96.4,129,156,187,222,274]
[null,null,null,null,null,null,null,null,null,null,null,null,null,null,null,null,null,358,"12433542 BLUE CR AB MIDNITE MINE DRAINAGE NR WELLPINIT, WA      ",27,12433542,"WA",1,6.0459785100000003,8.77,19.899999999999999,31.1,50.4,68.400000000000006,90.6,117,159]
[null,null,null,null,null,null,null,null,null,null,null,null,null,null,null,null,null,359,"12433580 COTTONWOOD (HAWK) CREEK AT DAVENPORT, WA",17,12433580,"WA",1,24.53,150,469,825,1460,2100,2880,3840,5410]
[null,null,null,null,null,null,null,null,null,null,null,null,null,null,null,null,null,360,"12433800 GRANITE CREEK NEAR REPUBLIC, WA",20,12433800,"WA",1,5.18,11.8,19.2,24.9,33.200000000000003,40.1,47.7,55.9,68.099999999999994]
[null,null,null,null,null,null,null,null,null,null,null,null,null,null,null,null,null,361,"12433890 SANPOIL RIVER ABOVE 13 MILE CREEK NEAR REPUBLIC, WA",15,12433890,"WA",2,241.73,352,604,799,1070,1300,1540,1790,2160]
[null,null,null,null,null,null,null,null,null,null,null,null,null,null,null,null,null,362,"12434110 WEST FORK SANPOIL RIVER NEAR REPUBLIC, WA",14,12434110,"WA",2,293.77999999999997,522,947,1290,1790,2210,2670,3170,3900]
[null,null,null,null,null,null,null,null,null,null,null,null,null,null,null,null,null,363,"12434500 SANPOIL RIVER NEAR KELLER, WA",15,12434500,"WA",2,827.85,1480,2460,3230,4340,5290,6320,7450,9120]
[null,null,null,null,null,null,null,null,null,null,null,null,null,null,null,null,null,364,"12437500 NESPELEM RIVER AT NESPELEM, WA",19,12437500,"WA",2,125.29,171,362,528,782,995,1240,1500,1890]
[null,null,null,null,null,null,null,null,null,null,null,null,null,null,null,null,null,365,"12437930 EAST FORK FOSTER CREEK AT LEAHY, WA",16,12437930,"WA",2,40.049999999999997,76,184,294,485,665,886,1150,1570]
[null,null,null,null,null,null,null,null,null,null,null,null,null,null,null,null,null,366,"12437950 EAST FORK FOSTER CREEK TRIB NEAR BRIDGEPORT, WA",21,12437950,"WA",1,3.28,25.5,79.7,143,263,387,551,759,1110]
[null,null,null,null,null,null,null,null,null,null,null,null,null,null,null,null,null,367,"12437960 WEST FORK FOSTER CREEK NEAR BRIDGEPORT, WA",16,12437960,"WA",1,26.54,69.2,169,275,466,651,885,1170,1650]
[null,null,null,null,null,null,null,null,null,null,null,null,null,null,null,null,null,368,"12439200 DRY CREEK TRIBUTARY NEAR MOLSON, WA             ",20,12439200,"WA",1,1.85,21.2,32.200000000000003,40.200000000000003,51.3,60.3,69.900000000000006,80.2,95.3]
[null,null,null,null,null,null,null,null,null,null,null,null,null,null,null,null,null,369,"12439300 TONASKET CREEK AT OROVILLE, WA               ",26,12439300,"WA",1,60.726309929999992,62.1,162,269,466,668,923,1240,1780]
[null,null,null,null,null,null,null,null,null,null,null,null,null,null,null,null,null,370,"12441700 MIDDLE FORK TOATS COULEE CREEK NEAR LOOMIS, WA",10,12441700,"WA",2,17,182,307,401,529,634,741,856,1020]
[null,null,null,null,null,null,null,null,null,null,null,null,null,null,null,null,null,371,"12442000 TOATS COULEE CREEK NEAR LOOMIS, WA",31,12442000,"WA",2,131,526,982,1380,1980,2520,3120,3800,4840]
[null,null,null,null,null,null,null,null,null,null,null,null,null,null,null,null,null,372,"12443700 SPECTACLE LAKE TRIB NEAR LOOMIS, WA",16,12443700,"WA",2,4.8099999999999996,6.08,31.3,69.8,156,257,394,578,907]
[null,null,null,null,null,null,null,null,null,null,null,null,null,null,null,null,null,373,"12444400 SIWACH CREEK TRIBUTARY NEAR TONASKET, WA",20,12444400,"WA",2,0.72,5.97,16.7,28.5,50.5,73.3,102,139,203]
[null,null,null,null,null,null,null,null,null,null,null,null,null,null,null,null,null,374,"12445800 OMAK CREEK TRIBUTARY NEAR DISAUTEL, WA",21,12445800,"WA",2,4.18,6.21,10.6,14,18.899999999999999,23.1,27.7,32.700000000000003,40.299999999999997]
[null,null,null,null,null,null,null,null,null,null,null,null,null,null,null,null,null,375,"12447380 PINE CREEK NEAR MAZAMA, WA",23,12447380,"WA",2,4.59,161,241,297,371,430,490,553,639]
[null,null,null,null,null,null,null,null,null,null,null,null,null,null,null,null,null,376,"12447383 METHOW RIVER ABOVE GOAT CREEK NEAR MAZAMA, WA        ",24,12447383,"WA",2,367.04882214000003,5150,6780,7780,8970,9810,10600,11400,12400]
[null,null,null,null,null,null,null,null,null,null,null,null,null,null,null,null,null,377,"12447390 ANDREWS CREEK NEAR MAZAMA, WA                ",46,12447390,"WA",2,22.432807683,381,536,648,800,922,1050,1190,1380]
[null,null,null,null,null,null,null,null,null,null,null,null,null,null,null,null,null,378,"12447400 DOE CREEK NEAR WINTHROP, WA",19,12447400,"WA",2,3.93,23.7,41.6,55.1,73.8,88.9,105,121,145]
[null,null,null,null,null,null,null,null,null,null,null,null,null,null,null,null,null,379,"12447430 ORTELL CREEK NEAR WINTHROP, WA",11,12447430,"WA",2,4.1100000000000003,59.8,75.599999999999994,85.7,98.4,108,117,127,139]
[null,null,null,null,null,null,null,null,null,null,null,null,null,null,null,null,null,380,"12448000 CHEWUCH RIVER AT WINTHROP, WA                ",23,"12448000","WA",2,524.2068117,3520,5410,6710,8350,9600,10800,12100,13700]
[null,null,null,null,null,null,null,null,null,null,null,null,null,null,null,null,null,381,"12448500 METHOW RIVER AT WINTHROP, WA                ",26,"12448500","WA",2,1036.1507013,9520,13700,16500,20100,22800,25500,28400,32200]
[null,null,null,null,null,null,null,null,null,null,null,null,null,null,null,null,null,382,"12448700 WILLIAMS CREEK NEAR TWISP, WA",11,12448700,"WA",2,3.02,58.9,75,85.4,98.6,108,118,128,142]
[null,null,null,null,null,null,null,null,null,null,null,null,null,null,null,null,null,383,"12448900 LITTLE BRIDGE CREEK NEAR TWISP, WA",11,12448900,"WA",2,17.57,128,188,229,282,323,363,405,462]
[null,null,null,null,null,null,null,null,null,null,null,null,null,null,null,null,null,384,"12448998 TWISP RIVER NEAR TWISP, WA                 ",29,12448998,"WA",2,244.28824991999997,2230,3280,4060,5120,5970,6870,7820,9180]
[null,null,null,null,null,null,null,null,null,null,null,null,null,null,null,null,null,385,"12449500 METHOW RIVER AT TWISP, WA                  ",62,12449500,"WA",2,1322.2704924,11100,15900,19100,23100,26000,28900,31800,35700]
[null,null,null,null,null,null,null,null,null,null,null,null,null,null,null,null,null,386,"12449600 BEAVER CREEK BELOW SOUTH FORK NEAR TWISP, WA",20,12449600,"WA",2,62.71,137,272,385,550,689,839,1000,1240]
[null,null,null,null,null,null,null,null,null,null,null,null,null,null,null,null,null,387,"12449790 RAINY CREEK NEAR METHOW, WA",11,12449790,"WA",2,8.59,56,90.4,117,154,185,219,255,307]
[null,null,null,null,null,null,null,null,null,null,null,null,null,null,null,null,null,388,"12449950 METHOW RIVER NEAR PATEROS, WA                ",56,12449950,"WA",2,1793.3437665000001,11600,16300,19300,23100,25900,28600,31300,34900]
[null,null,null,null,null,null,null,null,null,null,null,null,null,null,null,null,null,389,"12450500 METHOW RIVER AT PATEROS, WA",17,12450500,"WA",2,1819.75,11700,16400,19600,23900,27100,30500,33900,38700]
[null,null,null,null,null,null,null,null,null,null,null,null,null,null,null,null,null,390,"12451000 STEHEKIN RIVER AT STEHEKIN, WA               ",93,12451000,"WA",2,320.69365613999997,9530,12800,14900,17500,19500,21500,23500,26200]
[null,null,null,null,null,null,null,null,null,null,null,null,null,null,null,null,null,391,"12451500 RAILROAD CREEK AT LUCERNE, WA",34,12451500,"WA",2,64.97,1310,1880,2280,2830,3260,3710,4180,4850]
[null,null,null,null,null,null,null,null,null,null,null,null,null,null,null,null,null,392,"12452800 ENTIAT RIVER NEAR ARDENVOIR, WA               ",57,12452800,"WA",2,203.22500912999999,2670,3590,4180,4920,5460,6000,6540,7250]
[null,null,null,null,null,null,null,null,null,null,null,null,null,null,null,null,null,393,"12452880 TILLICUM CREEK NEAR ARDENVOIR, WA",11,12452880,"WA",2,7.17,34.1,56.2,72.8,95.6,114,134,154,183]
[null,null,null,null,null,null,null,null,null,null,null,null,null,null,null,null,null,394,"12452890 MAD RIVER AT ARDENVOIR, WA",13,12452890,"WA",2,91.19,657,811,902,1010,1080,1150,1220,1300]
[null,null,null,null,null,null,null,null,null,null,null,null,null,null,null,null,null,395,"12452990 ENTIAT RIVER NEAR ENTIAT, WA",19,12452990,"WA",2,415,2980,3900,4500,5240,5780,6330,6870,7600]
[null,null,null,null,null,null,null,null,null,null,null,null,null,null,null,null,null,396,"12453000 ENTIAT RIVER AT ENTIAT, WA",23,12453000,"WA",2,418.08,3460,4700,5550,6670,7540,8430,9370,10700]
[null,null,null,null,null,null,null,null,null,null,null,null,null,null,null,null,null,397,"12454000 WHITE RIVER NEAR PLAIN, WA                 ",29,12454000,"WA",2,149.05131813,4820,6380,7460,8880,9980,11100,12300,13900]
[null,null,null,null,null,null,null,null,null,null,null,null,null,null,null,null,null,398,"12454290 LITTLE WENATCHEE RIVER TRIBUTARY NEAR TELMA, WA",11,12454290,"WA",2,1.06,96.2,118,132,148,160,171,183,198]
[null,null,null,null,null,null,null,null,null,null,null,null,null,null,null,null,null,399,"12455000 WENATCHEE RIVER BELOW WENATCHEE LAKE, WA",48,12455000,"WA",2,273.89,7030,8840,9990,11400,12400,13400,14400,15700]
[null,null,null,null,null,null,null,null,null,null,null,null,null,null,null,null,null,400,"12456300 BRUSH CREEK NEAR TELMA, WA",11,12456300,"WA",2,2.72,62,102,134,178,215,255,298,360]
[null,null,null,null,null,null,null,null,null,null,null,null,null,null,null,null,null,401,"12456500 CHIWAWA RIVER NEAR PLAIN, WA                ",41,12456500,"WA",2,172.08608273999999,3190,4360,5110,6040,6720,7380,8040,8910]
[null,null,null,null,null,null,null,null,null,null,null,null,null,null,null,null,null,402,"12457000 WENATCHEE RIVER AT PLAIN, WA                ",92,12457000,"WA",2,596.70596699999999,11700,15700,18400,22000,24700,27500,30300,34200]
[null,null,null,null,null,null,null,null,null,null,null,null,null,null,null,null,null,403,"12457300 SKINNEY CREEK AT WINTON, WA",20,12457300,"WA",2,3.12,27.3,43.8,55.8,71.8,84.3,97.2,111,129]
[null,null,null,null,null,null,null,null,null,null,null,null,null,null,null,null,null,404,"12457900 CHATTER CREEK NEAR LEAVENWORTH, WA",10,12457900,"WA",2,2.3199999999999998,55.6,76.599999999999994,90.6,108,122,135,149,168]
[null,null,null,null,null,null,null,null,null,null,null,null,null,null,null,null,null,405,"12458000 ICICLE CREEK ABOVE SNOW CREEK NEAR LEAVENWORTH, WA",67,12458000,"WA",2,192.80552148000001,4580,6750,8360,10600,12400,14300,16400,19300]
[null,null,null,null,null,null,null,null,null,null,null,null,null,null,null,null,null,406,"12458900 POSEY CANYON NEAR LEAVENWORTH, WA",20,12458900,"WA",2,1.51,3.16,6.05,8.5,12.2,15.5,19.100000000000001,23.2,29.4]
[null,null,null,null,null,null,null,null,null,null,null,null,null,null,null,null,null,407,"12459000 WENATCHEE RIVER AT PESHASTIN, WA              ",86,12459000,"WA",2,999.13954139999998,16000,21200,24600,29100,32400,35900,39400,44200]
[null,null,null,null,null,null,null,null,null,null,null,null,null,null,null,null,null,408,"12459400 TRONSEN CREEK NEAR PESHASTIN, WA",16,12459400,"WA",2,3.51,26.7,45.6,59.8,79.099999999999994,94.6,111,128,151]
[null,null,null,null,null,null,null,null,null,null,null,null,null,null,null,null,null,409,"12461000 WENATCHEE RIVER AT DRYDEN, WA",12,12461000,"WA",2,1157.55,17500,23100,26500,30800,33800,36800,39800,43600]
[null,null,null,null,null,null,null,null,null,null,null,null,null,null,null,null,null,410,"12461100 EAST BRANCH MISSION CREEK NEAR CASHMERE, WA",20,12461100,"WA",2,15.63,23.2,46.4,67.2,100,130,164,203,263]
[null,null,null,null,null,null,null,null,null,null,null,null,null,null,null,null,null,411,"12461200 EAST BRANCH MISSION CREEK TRIB NEAR CASMERE, WA",34,12461200,"WA",2,2.44,7.03,13.9,19.8,29.1,37.200000000000003,46.5,56.8,72.599999999999994]
[null,null,null,null,null,null,null,null,null,null,null,null,null,null,null,null,null,412,"12461400 MISSION CREEK ABOVE SAND CREEK NEAR CASMERE, WA",21,12461400,"WA",2,39.85,193,399,589,892,1170,1490,1860,2420]
[null,null,null,null,null,null,null,null,null,null,null,null,null,null,null,null,null,413,"12461500 SAND CREEK NEAR CASHMERE, WA",20,12461500,"WA",2,18.690000000000001,66.099999999999994,119,164,233,293,360,435,549]
[null,null,null,null,null,null,null,null,null,null,null,null,null,null,null,null,null,414,"12462000 MISSION CREEK AT CASHMERE, WA",21,12462000,"WA",2,81.489999999999995,191,300,386,512,619,740,873,1070]
[null,null,null,null,null,null,null,null,null,null,null,null,null,null,null,null,null,415,"12462500 WENATCHEE RIVER AT MONITOR, WA               ",52,12462500,"WA",2,1302.0527520000001,17700,23700,28000,33900,38500,43400,48500,55900]
[null,null,null,null,null,null,null,null,null,null,null,null,null,null,null,null,null,416,"12462700 MOSES CREEK AT WATERVILLE, WA",20,12462700,"WA",2,3.15,27.6,63.5,98.4,158,213,281,362,491]
[null,null,null,null,null,null,null,null,null,null,null,null,null,null,null,null,null,417,"12462800 MOSES CREEK AT DOUGLAS, WA",22,12462800,"WA",2,15.62,68.400000000000006,147,219,338,445,572,719,948]
[null,null,null,null,null,null,null,null,null,null,null,null,null,null,null,null,null,418,"12463000 DOUGLAS CREEK NEAR ALSTOWN, WA",18,12463000,"WA",1,111.51,399,1310,2270,3980,5560,7560,9960,13700]
[null,null,null,null,null,null,null,null,null,null,null,null,null,null,null,null,null,419,"12463600 RATTLESNAKE CREEK TRIBUTARY NEAR SOAP LAKE, WA",18,12463600,"WA",1,2.33,9.43,37.9,75,151,230,338,477,716]
[null,null,null,null,null,null,null,null,null,null,null,null,null,null,null,null,null,420,"12463700 MCMARTENEY CREEK TRIBUTARY NEAR FARMER, WA",16,12463700,"WA",1,0.82,5.32,21.9,43.6,88,135,200,283,427]
[null,null,null,null,null,null,null,null,null,null,null,null,null,null,null,null,null,421,"12463800 PINE CANYON TRIBUTARY NEAR FARMER, WA",16,12463800,"WA",1,1.3,3.07,18.5,42.5,95.9,155,238,346,538]
[null,null,null,null,null,null,null,null,null,null,null,null,null,null,null,null,null,422,"12464600 SCHNEBLY COULEE TRIBUTARY NEAR VANTAGE, WA",20,12464600,"WA",1,0.76,3.72,17.600000000000001,37.4,79,126,187,267,409]
[null,null,null,null,null,null,null,null,null,null,null,null,null,null,null,null,null,423,"12464650 SOUTH FORK CRAB CREEK TRIBUTARY AT WAUKON, WA",20,12464650,"WA",1,1.71,17.7,35.9,53.2,82.3,109,142,182,245]
[null,null,null,null,null,null,null,null,null,null,null,null,null,null,null,null,null,424,"12464770 CRAB CREEK AT ROCKY FORD ROAD NEAR RITZVILLE, WA",16,12464770,"WA",2,456.26,636,1660,2710,4480,6080,8040,10300,13900]
[null,null,null,null,null,null,null,null,null,null,null,null,null,null,null,null,null,425,"12464800 COAL CREEK AT MOHLER, WA                  ",28,12464800,"WA",1,61.213490910000004,304,485,620,809,961,1130,1300,1550]
[null,null,null,null,null,null,null,null,null,null,null,null,null,null,null,null,null,426,"12465000 CRAB CREEK AT IRBY, WA                   ",72,12465000,"WA",1,1045.3313871,766,2110,3490,5860,8080,10700,13800,18600]
[null,null,null,null,null,null,null,null,null,null,null,null,null,null,null,null,null,427,"12465100 CONNAWAI CREEK TRIBUTARY NEAR GOVAN, WA",20,12465100,"WA",1,1.07,4.92,21.9,45.1,93.9,147,218,312,476]
[null,null,null,null,null,null,null,null,null,null,null,null,null,null,null,null,null,428,"12465300 BROADAX DRAW TRIBUTARY NEAR WILBUR, WA",20,12465300,"WA",1,0.83,21.3,51.9,81.599999999999994,132,180,239,309,422]
[null,null,null,null,null,null,null,null,null,null,null,null,null,null,null,null,null,429,"12465400 WILSON CREEK BELOW CORBETT DRAW NEAR ALMIRA, WA       ",26,12465400,"WA",1,336.01727016000001,591,1550,2520,4170,5700,7550,9750,13200]
[null,null,null,null,null,null,null,null,null,null,null,null,null,null,null,null,null,430,"12465500 WILSON CREEK AT WILSON CREEK, WA              ",28,12465500,"WA",1,434.51346510000002,1000,2500,3980,6480,8780,11600,14900,20000]
[null,null,null,null,null,null,null,null,null,null,null,null,null,null,null,null,null,431,"12467400 HAYNES CANYON NEAR COULEE CITY, WA",18,12467400,"WA",1,2.0299999999999998,6.98,30,61.2,126,195,290,411,622]
[null,null,null,null,null,null,null,null,null,null,null,null,null,null,null,null,null,432,"12470300 IRON SPRINGS CREEK NEAR WINCHESTER, WA",18,12470300,"WA",1,1.57,15.3,40.200000000000003,65.7,111,154,207,271,376]
[null,null,null,null,null,null,null,null,null,null,null,null,null,null,null,null,null,433,"12471100 PAHA COULEE TRIBUTARY NEAR RITZVILLE, WA",15,12471100,"WA",1,8.0299999999999994,105,183,244,335,410,494,586,721]
[null,null,null,null,null,null,null,null,null,null,null,null,null,null,null,null,null,434,"12471200 LIND COULEE TRIBUTARY NEAR LIND, WA",18,12471200,"WA",1,0.59,7.23,18.3,30.1,51.9,73.8,102,137,197]
[null,null,null,null,null,null,null,null,null,null,null,null,null,null,null,null,null,435,"12471270 FARRIER COULEE NEAR SCHRAG, WA",16,12471270,"WA",1,44.19,145,492,877,1580,2260,3120,4180,5890]
[null,null,null,null,null,null,null,null,null,null,null,null,null,null,null,null,null,436,"12474700 MOSQUITO CREEK NEAR EASTON, WA",10,12474700,"WA",1,1.07,84.7,121,146,178,201,227,252,286]
[null,null,null,null,null,null,null,null,null,null,null,null,null,null,null,null,null,437,"12480500 TEANAWAY RIVER NEAR CLE ELUM, WA",10,12480500,"WA",1,199.92,2780,3730,4340,5080,5630,6160,6690,7380]
[null,null,null,null,null,null,null,null,null,null,null,null,null,null,null,null,null,438,"12480700 HOVEY CREEK NEAR CLE ELUM, WA",20,12480700,"WA",2,2.73,32.1,42.4,49.2,58,64.599999999999994,71.2,78,87.3]
[null,null,null,null,null,null,null,null,null,null,null,null,null,null,null,null,null,439,"12483300 SF MANASTASH CREEK TRIBUTARY NEAR ELLENSBURG, WA",20,12483300,"WA",2,2.11,31.6,52.8,69.7,94.4,116,139,166,205]
[null,null,null,null,null,null,null,null,null,null,null,null,null,null,null,null,null,440,"12483800 NANEUM CREEK NEAR ELLENSBURG, WA",21,12483800,"WA",2,68.62,404,607,747,929,1070,1210,1360,1560]
[null,null,null,null,null,null,null,null,null,null,null,null,null,null,null,null,null,441,"12484200 JOHNSON CANYON TRIBUTARY NEAR KITTITAS, WA",20,12484200,"WA",2,0.66,2.1800000000000002,9.59,20.3,43.9,71.400000000000006,109,161,256]
[null,null,null,null,null,null,null,null,null,null,null,null,null,null,null,null,null,442,"12484600 MCPHERSON CANYON AT WYMER, WA",24,12484600,"WA",2,5.57,35.5,80.8,125,199,271,358,463,637]
[null,null,null,null,null,null,null,null,null,null,null,null,null,null,null,null,null,443,"12485700 SELAH CREEK TRIBUTARY NEAR YAKIMA, WA",20,12485700,"WA",2,0.81,2.37,12.2,27.4,62,103,160,237,378]
[null,null,null,null,null,null,null,null,null,null,null,null,null,null,null,null,null,444,"12485900 PINE CANYON NEAR NACHES, WA",16,12485900,"WA",2,2.25,11.8,29.6,49.4,87.4,128,182,251,375]
[null,null,null,null,null,null,null,null,null,null,null,null,null,null,null,null,null,445,"12487400 DEEP CREEK NEAR GOOSE PRAIRIE, WA",10,12487400,"WA",2,12.54,461,621,720,839,924,1010,1090,1190]
[null,null,null,null,null,null,null,null,null,null,null,null,null,null,null,null,null,446,"12488300 AMERICAN RIVER TRIBUTARY NEAR NILE, WA",20,12488300,"WA",2,1.1100000000000001,17.399999999999999,23.9,28,33.1,36.799999999999997,40.4,43.9,48.6]
[null,null,null,null,null,null,null,null,null,null,null,null,null,null,null,null,null,447,"12488500 AMERICAN RIVER NEAR NILE, WA ",75,12488500,"WA",2,79.216252830000002,1600,2420,3030,3870,4550,5260,6020,7080]
[null,null,null,null,null,null,null,null,null,null,null,null,null,null,null,null,null,448,"12489500 NACHES RIVER AT OAK FLAT NEAR NILE, WA",13,12489500,"WA",2,640.15,6420,9480,11700,14700,17000,19500,22000,25600]
[null,null,null,null,null,null,null,null,null,null,null,null,null,null,null,null,null,449,"12491700 HAUSE CREEK NEAR RIMROCK, WA",34,12491700,"WA",2,3.55,26.7,47.5,65.099999999999994,89.9,116,143,174,222]
[null,null,null,null,null,null,null,null,null,null,null,null,null,null,null,null,null,450,"12492500 TIETON RIVER AT CANAL HEADWORKS NEAR NACHES, WA",71,12492500,"WA",2,240.22,2390,3510,4290,5310,6100,6910,7750,8910]
[null,null,null,null,null,null,null,null,null,null,null,null,null,null,null,null,null,451,"12500500 NORTH FORK AHTANUM CREEK NEAR TAMPICO, WA          ",61,12500500,"WA",2,69.541088760000008,382,579,719,909,1060,1210,1380,1610]
[null,null,null,null,null,null,null,null,null,null,null,null,null,null,null,null,null,452,"12501000 SF AHTANUM CREEK AT CONRAD RANCH NR TAMPICO, WA       ",58,12501000,"WA",2,24.958121759999997,98.3,189,271,403,525,669,838,1110]
[null,null,null,null,null,null,null,null,null,null,null,null,null,null,null,null,null,453,"12502000 AHTANUM CREEK AT THE NARROWS NEAR TAMPICO, WA",14,12502000,"WA",2,120.83,520,870,1150,1570,1930,2320,2770,3430]
[null,null,null,null,null,null,null,null,null,null,null,null,null,null,null,null,null,454,"12502500 AHTANUM CREEK AT UNION GAP, WA               ",61,12502500,"WA",2,172.20928724999999,430,861,1240,1820,2340,2950,3640,4720]
[null,null,null,null,null,null,null,null,null,null,null,null,null,null,null,null,null,455,"12506000 TOPPENISH CREEK NEAR FORT SIMCOE, WA",19,12506000,"WA",2,121.39,819,1470,2000,2780,3440,4170,4990,6190]
[null,null,null,null,null,null,null,null,null,null,null,null,null,null,null,null,null,456,"12506500 SIMCOE CREEK BELOW SPRING CREEK NR FORT SIMCOE, WA",15,12506500,"WA",2,79.87,241,553,852,1340,1800,2340,2970,3970]
[null,null,null,null,null,null,null,null,null,null,null,null,null,null,null,null,null,457,"12507600 SHINANDO CREEK TRIBUTARY NEAR GOLDENDALE, WA",20,12507600,"WA",2,0.42,3.27,8.4700000000000006,13.7,22.6,31.1,40.9,52.6,71.099999999999994]
[null,null,null,null,null,null,null,null,null,null,null,null,null,null,null,null,null,458,"12507660 SATUS CREEK TRIBUTARY NEAR TOPPENISH, WA",18,12507660,"WA",2,8.68,120,297,480,802,1120,1520,2000,2820]
[null,null,null,null,null,null,null,null,null,null,null,null,null,null,null,null,null,459,"12508500 SATUS CREEK BELOW DRY CREEK NEAR TOPPENISH, WA",11,12508500,"WA",2,433.68,1380,2440,3120,4630,5770,7050,8480,10600]
[null,null,null,null,null,null,null,null,null,null,null,null,null,null,null,null,null,460,"12512500 PROVIDENCE COULEE AT CUNNINGHAM, WA             ",25,12512500,"WA",2,28.163717010000003,23.9,174,442,1070,1830,2820,4160,6500]
[null,null,null,null,null,null,null,null,null,null,null,null,null,null,null,null,null,461,"12512550 PROVIDENCE COULEE NEAR CUNNINGHAM, WA",19,12512550,"WA",2,53.11,151,435,748,1320,1900,2630,3540,5070]
[null,null,null,null,null,null,null,null,null,null,null,null,null,null,null,null,null,462,"12512600 HATTON COULEE TRIBUTARY NO 2 NEAR CUNNINGHAM, WA",16,12512600,"WA",2,2.48,3.67,21.3,50.1,117,198,310,464,746]
[null,null,null,null,null,null,null,null,null,null,null,null,null,null,null,null,null,463,"12512700 HATTON COULEE TRIBUTARY NEAR HATTON, WA",20,12512700,"WA",2,3.99,4.87,24,53.8,123,207,325,489,794]
[null,null,null,null,null,null,null,null,null,null,null,null,null,null,null,null,null,464,"12513000 ESQUATZEL COULEE AT CONNELL, WA               ",60,12513000,"WA",2,232.48505709,106,702,1770,4410,7660,12100,18200,28900]
[null,null,null,null,null,null,null,null,null,null,null,null,null,null,null,null,null,468,"13334450 ASOTIN CREEK BELOW CONFLUENCE NEAR ASOTIN, WA        ",14,13334450,"WA",2,104.18,344,614,839,1170,1440,1750,2090,2580]
[null,null,null,null,null,null,null,null,null,null,null,null,null,null,null,null,null,469,"13334500 ASOTIN CREEK NEAR ASOTIN, WA",32,13334500,"WA",1,157.04,344,563,736,987,1190,1420,1670,2030]
[null,null,null,null,null,null,null,null,null,null,null,null,null,null,null,null,null,470,"13334700  ASOTIN CREEK BELOW KEARNEY GULCH NEAR ASOTIN, WA      ",30,13334700,"WA",1,170.37469449,426,965,1510,2460,3340,4450,5780,7920]
[null,null,null,null,null,null,null,null,null,null,null,null,null,null,null,null,null,471,"13335050 ASOTIN CREEK AT ASOTIN, WA                 ",25,13335050,"WA",1,324.56087235000001,670,1430,2160,3380,4480,5830,7420,9920]
[null,null,null,null,null,null,null,null,null,null,null,null,null,null,null,null,null,472,"13335200 CRITCHFIELD DRAW NEAR CLARKSTON, WA",18,13335200,"WA",1,1.77,15.7,72.8,145,288,432,626,872,1290]
[null,null,null,null,null,null,null,null,null,null,null,null,null,null,null,null,null,481,"13343450 DRY CREEK AT MOUTH NEAR CLARKSTON, WA",15,13343450,"WA",1,7.03,80.900000000000006,255,442,794,1140,1610,2210,3210]
[null,null,null,null,null,null,null,null,null,null,null,null,null,null,null,null,null,482,"13343520 CLAYTON GULCH NEAR ALPOWA, WA",16,13343520,"WA",1,5.77,90.6,182,260,383,489,614,754,969]
[null,null,null,null,null,null,null,null,null,null,null,null,null,null,null,null,null,483,"13343620 SOUTH FORK DEADMAN CREEK TRIBUTARY NEAR PATAHA, WA",16,13343620,"WA",1,0.64,18.2,53.5,90.4,158,222,306,409,578]
[null,null,null,null,null,null,null,null,null,null,null,null,null,null,null,null,null,484,"13343660 SMITH GULCH TRIBUTARY NEAR PATAHA, WA",20,13343660,"WA",1,1.75,42,122,206,357,500,683,905,1270]
[null,null,null,null,null,null,null,null,null,null,null,null,null,null,null,null,null,485,"13343800 MEADOW CREEK NEAR CENTRAL FERRY, WA",15,13343800,"WA",1,67.430000000000007,502,1250,1940,3050,4010,5160,6480,8470]
[null,null,null,null,null,null,null,null,null,null,null,null,null,null,null,null,null,486,"13344500 TUCANNON RIVER NEAR STARBUCK, WA              ",58,13344500,"WA",1,431.45362259999996,1170,2530,3800,5870,7720,9930,12500,16400]
[null,null,null,null,null,null,null,null,null,null,null,null,null,null,null,null,null,490,"13346100 PALOUSE RIVER AT COLFAX, WA",24,13346100,"WA",1,491.96,4450,6770,8370,10500,12000,13700,15300,17600]
[null,null,null,null,null,null,null,null,null,null,null,null,null,null,null,null,null,492,"13348000 SOUTH FORK PALOUSE RIVER AT PULLMAN, WA        ",47,13348000,"WA",1,127.58,965,1720,2340,3300,4110,5050,6110,7720]
[null,null,null,null,null,null,null,null,null,null,null,null,null,null,null,null,null,493,"13348400 MISSOURI FLAT CREEK TRIBUTARY NEAR PULLMAN, WA",20,13348400,"WA",1,0.9,33.299999999999997,69.3,103,161,216,283,365,498]
[null,null,null,null,null,null,null,null,null,null,null,null,null,null,null,null,null,494,"13348500 MISSOURI FLAT CREEK AT PULLMAN, WA",27,13348500,"WA",1,27.16,400,663,872,1180,1440,1730,2050,2540]
[null,null,null,null,null,null,null,null,null,null,null,null,null,null,null,null,null,495,"13349210 PALOUSE RIVER BELOW SOUTH FORK AT COLFAX, WA        ",33,13349210,"WA",1,789.80731830000002,5580,9080,11700,15200,17900,20900,24000,28300]
[null,null,null,null,null,null,null,null,null,null,null,null,null,null,null,null,null,496,"13349300 PALOUSE RIVER TRIBUTARY AT COLFAX, WA",34,13349300,"WA",1,2.12,29.1,65.2,100,160,216,284,367,500]
[null,null,null,null,null,null,null,null,null,null,null,null,null,null,null,null,null,497,"13349350 HARDMAN DRAW TRIBUTARY AT PLAZA, WA",20,13349350,"WA",1,1.66,37,95.2,158,276,396,555,758,1110]
[null,null,null,null,null,null,null,null,null,null,null,null,null,null,null,null,null,498,"13349400 PINE CREEK AT PINE CITY, WA",18,13349400,"WA",1,302.38,1830,3700,5330,7900,10100,12800,15800,20400]
[null,null,null,null,null,null,null,null,null,null,null,null,null,null,null,null,null,499,"13349500 ROCK CREEK NEAR EWAN, WA",18,13349500,"WA",1,544.26,1460,2390,3120,4160,5000,5920,6920,8370]
[null,null,null,null,null,null,null,null,null,null,null,null,null,null,null,null,null,500,"13349670 PLEASANT VALLEY CREEK TRIBUTARY NEAR THORNTON, WA",11,13349670,"WA",1,0.76,24.8,42.6,56.9,78.400000000000006,96.3,117,139,172]
[null,null,null,null,null,null,null,null,null,null,null,null,null,null,null,null,null,501,"13349800 IMBLER CREEK TRIBUTARY NEAR LAMONT, WA",11,13349800,"WA",1,1.32,54.7,88.4,116,160,198,243,293,372]
[null,null,null,null,null,null,null,null,null,null,null,null,null,null,null,null,null,502,"13350500 UNION FLAT CREEK NEAR COLFAX, WA",26,13350500,"WA",1,190.51,881,1560,2100,2890,3530,4240,5020,6150]
[null,null,null,null,null,null,null,null,null,null,null,null,null,null,null,null,null,503,"13350800 WILLOW CREEK TRIBUTARY NEAR LACROSSE, WA",11,13350800,"WA",1,1.04,15.5,32.700000000000003,48.7,75.2,99.1,128,161,214]
[null,null,null,null,null,null,null,null,null,null,null,null,null,null,null,null,null,504,"13351000 PALOUSE RIVER AT HOOPER, WA",82,13351000,"WA",1,2502.4699999999998,7290,13200,18000,25100,31000,37600,44900,55600]
[null,null,null,null,null,null,null,null,null,null,null,null,null,null,null,null,null,505,"13352200 COW CREEK TRIBUTARY NEAR RITZVILLE, WA",20,13352200,"WA",1,1.32,19.600000000000001,54,90.3,155,218,299,396,556]
[null,null,null,null,null,null,null,null,null,null,null,null,null,null,null,null,null,506,"13352500 COW  CREEK AT HOOPER, WA",19,13352500,"WA",1,674.47,160,526,984,1870,2750,3890,5300,7650]
[null,null,null,null,null,null,null,null,null,null,null,null,null,null,null,null,null,507,"13352550 STEWART CANYON TRIBUTARY NEAR RIPARIA, WA",18,13352550,"WA",1,1.95,19.5,60.8,108,199,292,415,570,834]
[null,null,null,null,null,null,null,null,null,null,null,null,null,null,null,null,null,511,"14013000 MILL CREEK NEAR WALLA WALLA, WA               ",75,14013000,"WA",1,58.680636300000003,925,1560,2080,2850,3490,4200,5000,6180]
[null,null,null,null,null,null,null,null,null,null,null,null,null,null,null,null,null,512,"14013500 BLUE CREEK NEAR WALLA WALLA, WA               ",31,14013500,"WA",1,17.31924909,325,557,735,984,1180,1390,1620,1940]
[null,null,null,null,null,null,null,null,null,null,null,null,null,null,null,null,null,513,"14013700 MILL CREEK AT FIVE MILE ROAD BRIDGE NEAR WALLA WALLA",17,14013700,"WA",1,92.77,1230,1770,2140,2630,2990,3360,3740,4260]
[null,null,null,null,null,null,null,null,null,null,null,null,null,null,null,null,null,514,"14015900 SPRING CREEK TRIBUTARY NEAR WALLA WALLA, WA",20,14015900,"WA",1,1.85,24.4,77.900000000000006,142,267,390,558,769,1130]
[null,null,null,null,null,null,null,null,null,null,null,null,null,null,null,null,null,515,"14016000 DRY CREEK NEAR WALLA WALLA, WA",18,14016000,"WA",1,46.39,546,1130,1650,2430,3080,3850,4700,5970]
[null,null,null,null,null,null,null,null,null,null,null,null,null,null,null,null,null,517,"14016500 EAST FORK TOUCHET RIVER NEAR DAYTON, WA",21,14016500,"WA",1,102.19,881,1500,2030,2880,3530,4280,5110,6340]
[null,null,null,null,null,null,null,null,null,null,null,null,null,null,null,null,null,518,"14016600 HATLEY CREEK NEAR DAYTON, WA",20,14016600,"WA",1,3.76,76.7,178,273,425,555,712,891,1160]
[null,null,null,null,null,null,null,null,null,null,null,null,null,null,null,null,null,519,"14016650 DAVIS HOLLOW NEAR DAYTON, WA",20,14016650,"WA",1,3.04,14.4,66.8,140,292,447,661,932,1400]
[null,null,null,null,null,null,null,null,null,null,null,null,null,null,null,null,null,520,"14017000 TOUCHET RIVER AT BOLLES, WA                 ",43,14017000,"WA",1,363.57843951000001,2600,4290,5510,7150,8410,9730,11100,13000]
[null,null,null,null,null,null,null,null,null,null,null,null,null,null,null,null,null,521,"14017040 THORN HOLLOW NEAR DAYTON, WA",15,14017040,"WA",1,3.73,35.9,107,184,319,446,607,799,1110]
[null,null,null,null,null,null,null,null,null,null,null,null,null,null,null,null,null,522,"14017070 EAST FORK MCKAY CREEK NEAR HUNTSVILLE, WA",15,14017070,"WA",1,4.49,57,168,289,513,730,1020,1380,1980]
[null,null,null,null,null,null,null,null,null,null,null,null,null,null,null,null,null,523,"14017200 BADGER HOLLOW NEAR CLYDE, WA",20,14017200,"WA",1,4.21,48,152,271,498,726,920,1420,2070]
[null,null,null,null,null,null,null,null,null,null,null,null,null,null,null,null,null,524,"14017500 TOUCHET RIVER NEAR TOUCHET, WA",16,14017500,"WA",1,727.09,3730,6490,8690,11900,14500,17500,20700,25400]
[null,null,null,null,null,null,null,null,null,null,null,null,null,null,null,null,null,525,"14018500 WALLA WALLA RIVER NEAR TOUCHET, WA             ",64,14018500,"WA",1,1657.9330911000002,5850,10300,13900,19400,24100,29400,35300,44100]
[null,null,null,null,null,null,null,null,null,null,null,null,null,null,null,null,null,526,"14019100 WALLA WALLA RIVER TRIBUTARY NEAR WALLULA, WA",23,14019100,"WA",1,0.91,1.4,15.2,40.5,98.7,163,254,376,590]
[null,null,null,null,null,null,null,null,null,null,null,null,null,null,null,null,null,527,"14034250 GLADE CREEK TRIBUTARY NEAR BICKLETON, WA",16,14034250,"WA",1,0.27,6.88,15.3,23.5,37.799999999999997,51.5,68.599999999999994,89.4,124]
[null,null,null,null,null,null,null,null,null,null,null,null,null,null,null,null,null,528,"14034325 ALDER CREEK NEAR BICKLETON, WA",15,14034325,"WA",1,8.23,181,373,547,839,1110,1440,1840,2480]
[null,null,null,null,null,null,null,null,null,null,null,null,null,null,null,null,null,533,"14107000 KLICKITAT RIVER ABOVE WEST FORK NEAR GLENWOOD, WA    ",57,14107000,"WA",1,152.02861245,1890,2680,3240,3980,4570,5200,5860,6810]
[null,null,null,null,null,null,null,null,null,null,null,null,null,null,null,null,null,534,"14110000 KLICKITAT RIVER NEAR GLENWOOD, WA              ",69,14110000,"WA",1,360.46180169999997,3210,4610,5600,6930,7990,9100,10300,12000]
[null,null,null,null,null,null,null,null,null,null,null,null,null,null,null,null,null,535,"14111400 KLICKITAT RIVER BL SUMMIT CREEK NEAR GLENWOOD, WA",18,14111400,"WA",4,759.54,5240,7880,9760,12300,14300,16400,18600,21800]
[null,null,null,null,null,null,null,null,null,null,null,null,null,null,null,null,null,536,"14111800 WEST PRONG LITTLE KLICKITAT RIVER NEAR GOLDENDALE, WA",15,14111800,"WA",4,10.29,123,254,375,565,733,920,1120,1430]
[null,null,null,null,null,null,null,null,null,null,null,null,null,null,null,null,null,537,"14112000 LITTLE KLICKITAT RIVER NEAR GOLDENDALE, WA",27,14112000,"WA",4,82.25,1070,2090,2970,4320,5480,6760,8150,10200]
[null,null,null,null,null,null,null,null,null,null,null,null,null,null,null,null,null,538,"14112200 LITTLE KLICKITAT RIVER TRIBUTARY NEAR GOLDENDALE, WA",29,14112200,"WA",4,0.7,24,52.6,77.3,113,140,168,196,234]
[null,null,null,null,null,null,null,null,null,null,null,null,null,null,null,null,null,539,"14112400 MILL CREEK NEAR BLOCKHOUSE, WA",14,14112400,"WA",4,28.82,140,274,399,603,793,1020,1270,1660]
[null,null,null,null,null,null,null,null,null,null,null,null,null,null,null,null,null,540,"14112500 LITTLE KLICKITAT RIVER NEAR WAHKIACUS, WA          ",36,14112500,"WA",4,279.86184369,3240,6420,9160,13300,16800,20700,24900,31200]
[null,null,null,null,null,null,null,null,null,null,null,null,null,null,null,null,null,541,"14113000 KLICKITAT RIVER NEAR PITT, WA                ",89,14113000,"WA",4,1299.577851,7700,14200,19900,28600,36500,45600,56000,72200]
[null,null,null,null,null,null,null,null,null,null,null,null,null,null,null,null,null,545,"14121300 WHITE SALMON RIVER BL CASCADES CR NR TROUT LAKE, WA",21,14121300,"WA",4,29.83,704,977,1160,1390,1570,1750,1930,2180]
[null,null,null,null,null,null,null,null,null,null,null,null,null,null,null,null,null,546,"14121400 WHITE SALMON RIVER ABV TROUT LAKE CK NR TROUT LAKE",10,14121400,"WA",4,62.62,751,944,1060,1210,1310,1410,1510,1640]
[null,null,null,null,null,null,null,null,null,null,null,null,null,null,null,null,null,547,"14121500 TROUT LAKE CREEK NEAR TROUT LAKE, WA",12,14121500,"WA",4,68.47,1610,2220,2640,3160,3600,3960,4370,4920]
[null,null,null,null,null,null,null,null,null,null,null,null,null,null,null,null,null,548,"14122000 WHITE SALMON RIVER NEAR TROUT LAKE, WA",13,14122000,"WA",4,156.44999999999999,2020,2860,3450,4210,4800,5400,6030,6900]
[null,null,null,null,null,null,null,null,null,null,null,null,null,null,null,null,null,549,"14123000 WHITE SALMON RIVER AT HUSUM, WA",26,14123000,"WA",4,295.39999999999998,2930,4450,5590,7190,8510,9940,11500,13800]
[null,null,null,null,null,null,null,null,null,null,null,null,null,null,null,null,null,550,"14123500 WHITE SALMON RIVER NEAR UNDERWOOD, WA            ",93,14123500,"WA",4,386.23436279999999,4550,7330,9610,13100,16100,19500,23400,29400]
[null,null,null,null,null,null,null,null,null,null,null,null,null,null,null,null,null,551,"14124500 LITTLE WHITE SALMON RIVER AT WILLARD, WA",17,14124500,"WA",4,111.62,2780,3420,3790,4220,4520,4810,5080,5430]
[null,null,null,null,null,null,null,null,null,null,null,null,null,null,null,null,null,552,"14125000 LITTLE WHITE SALMON RIVER AB LAPHAM CR NR WILLARD, WA",14,14125000,"WA",4,114.17,2540,3190,3620,4150,4550,4960,5360,5920]
[null,null,null,null,null,null,null,null,null,null,null,null,null,null,null,null,null,553,"14125200 ROCK CREEK NEAR WILLARD, WA",20,14125200,"WA",4,4.05,193,280,343,428,495,566,639,745]
[null,null,null,null,null,null,null,null,null,null,null,null,null,null,null,null,null,554,"14125500 LITTLE WHITE SALMON RIVER NEAR COOK, WA",21,14125500,"WA",4,131.49,3340,5290,6800,8970,10800,12700,14900,18000]
[null,null,null,null,null,null,null,null,null,null,null,null,null,null,null,null,null,555,"14126300 COLUMBIA RIVER TRIBUTARY AT HOME VALLEY, WA",21,14126300,"WA",4,0.76,43.9,62.1,74.599999999999994,90.6,103,115,128,145]
[null,null,null,null,null,null,null,null,null,null,null,null,null,null,null,null,null,556,"14127000 WIND RIVER ABOVE TROUT CREEK NEAR CARSON, WA        ",25,14127000,"WA",4,106.95116718,5240,6810,7780,8950,9790,10600,11400,12400]
[null,null,null,null,null,null,null,null,null,null,null,null,null,null,null,null,null,557,"14127200 LAYOUT CREEK NEAR CARSON, WA",10,14127200,"WA",4,1.83,340,480,571,684,767,849,930,1040]
[null,null,null,null,null,null,null,null,null,null,null,null,null,null,null,null,null,558,"14128500 WIND RIVER NEAR CARSON, WA                 ",47,14128500,"WA",4,214.97538347999998,14300,22200,28000,36000,42300,49000,55900,65800]
[null,null,null,null,null,null,null,null,null,null,null,null,null,null,null,null,null,575,"14143200 CANYON CREEK NEAR WASHOUGAL, WA",22,14143200,"WA",4,2.7,129,182,220,271,311,353,396,458]
[null,null,null,null,null,null,null,null,null,null,null,null,null,null,null,null,null,576,"14143500 WASHOUGAL RIVER NEAR WASHOUGAL, WA             ",37,14143500,"WA",4,107.19302021999999,14300,19700,23300,28100,31700,35300,39000,44200]
[null,null,null,null,null,null,null,null,null,null,null,null,null,null,null,null,null,577,"14144000 LITTLE WASHOUGAL RIVER NEAR WASHOUGAL, WA",17,14144000,"WA",4,23.34,1250,1710,2020,2400,2690,3000,3250,3640]
[null,null,null,null,null,null,null,null,null,null,null,null,null,null,null,null,null,578,"14144550 SHANGHAI CREEK NEAR HOCKINSON, WA",21,14144550,"WA",4,2.12,76.2,108,129,155,174,194,214,241]
[null,null,null,null,null,null,null,null,null,null,null,null,null,null,null,null,null,584,"14212000 SALMON CREEK NEAR BATTLE GROUND, WA             ",37,14212000,"WA",4,18.08164215,837,1182,1420,1740,1980,2240,2500,2860]
[null,null,null,null,null,null,null,null,null,null,null,null,null,null,null,null,null,585,"14213200 LEWIS RIVER NEAR TROUT LAKE, WA",14,14213200,"WA",4,127.39,5950,8930,11100,14000,16300,18800,21300,24900]
[null,null,null,null,null,null,null,null,null,null,null,null,null,null,null,null,null,586,"14213500 BIG CREEK BELOW SKOOKUM MEADOW NEAR TROUT LAKE, WA",27,14213500,"WA",4,13.08,401,612,763,963,1120,1280,1450,1680]
[null,null,null,null,null,null,null,null,null,null,null,null,null,null,null,null,null,587,"14214000 RUSH CREEK ABOVE MEADOW CREEK NEAR TROUT LAKE, WA",10,14214000,"WA",4,5.34,471,748,946,1210,1410,1610,1820,2110]
[null,null,null,null,null,null,null,null,null,null,null,null,null,null,null,null,null,588,"14214500 MEADOW CR BL LONE BUTTE MEADOW NR TROUT LAKE, WA",13,14214500,"WA",4,11.67,283,382,449,532,596,660,725,813]
[null,null,null,null,null,null,null,null,null,null,null,null,null,null,null,null,null,589,"14215000 RUSH CREEK ABOVE FALLS NEAR COUGAR, WA",21,14215000,"WA",4,25.41,740,1110,1390,1760,2060,2370,2710,3190]
[null,null,null,null,null,null,null,null,null,null,null,null,null,null,null,null,null,590,"14215500 CURLY CREEK NEAR COUGAR, WA",19,14215500,"WA",4,14.73,592,1060,1450,2010,2490,3010,3580,4420]
[null,null,null,null,null,null,null,null,null,null,null,null,null,null,null,null,null,591,"14216000 LEWIS RIVER ABOVE MUDDY RIVER NEAR COUGAR, WA        ",36,14216000,"WA",4,229.58421056999998,9800,15600,19600,24900,29000,33200,37400,43100]
[null,null,null,null,null,null,null,null,null,null,null,null,null,null,null,null,null,592,"14216500 MUDDY RIVER BELOW CLEAR CREEK NEAR COUGAR, WA        ",57,14216500,"WA",4,134.95121639999999,6860,10200,12500,15600,18000,20500,23000,26600]
[null,null,null,null,null,null,null,null,null,null,null,null,null,null,null,null,null,593,"14216800 PINE CREEK NEAR COUGAR, WA",14,14216800,"WA",4,21.55,987,1350,1590,1900,2130,2360,2600,2910]
[null,null,null,null,null,null,null,null,null,null,null,null,null,null,null,null,null,594,"14217500 SWIFT CREEK NEAR COUGAR, WA",11,14217500,"WA",4,20.82,1150,1590,1880,2230,2490,2740,2980,3310]
[null,null,null,null,null,null,null,null,null,null,null,null,null,null,null,null,null,595,"14218000 LEWIS RIVER NEAR COUGAR, WA",50,14218000,"WA",4,495.68,18000,29400,38000,50000,59600,69900,80900,96500]
[null,null,null,null,null,null,null,null,null,null,null,null,null,null,null,null,null,596,"14218300 DOG CREEK AT COUGAR, WA",18,14218300,"WA",4,2.34,314,427,505,605,682,761,841,953]
[null,null,null,null,null,null,null,null,null,null,null,null,null,null,null,null,null,597,"14219000 CANYON CREEK NEAR AMBOY, WA",20,14219000,"WA",4,64.62,5760,8020,9530,11400,12900,14300,15800,17700]
[null,null,null,null,null,null,null,null,null,null,null,null,null,null,null,null,null,598,"14219500 LEWIS RIVER NEAR AMBOY, WA",20,14219500,"WA",4,680.98,33700,50600,62100,76800,87700,98600,110000,124000]
[null,null,null,null,null,null,null,null,null,null,null,null,null,null,null,null,null,599,"14219800 SPEELYAI CREEK NEAR COUGAR, WA               ",55,14219800,"WA",4,12.65593329,1740,2400,2830,3350,3730,4090,4450,4920]
[null,null,null,null,null,null,null,null,null,null,null,null,null,null,null,null,null,600,"14221500 CEDAR CREEK NEAR ARIEL, WA",13,14221500,"WA",4,41,1500,1900,2150,2460,2680,2900,3120,3410]
[null,null,null,null,null,null,null,null,null,null,null,null,null,null,null,null,null,601,"14222500 EAST FORK LEWIS RIVER NEAR HEISSON, WA           ",82,14222500,"WA",4,125.05365873,9160,12900,15400,18500,20800,23100,25300,28300]
[null,null,null,null,null,null,null,null,null,null,null,null,null,null,null,null,null,603,"14223500 KALAMA RIVER BELOW ITALIAN CREEK NEAR KALAMA, WA      ",34,14223500,"WA",4,198.34972443000001,10600,13900,16100,19000,21100,23300,25600,28700]
[null,null,null,null,null,null,null,null,null,null,null,null,null,null,null,null,null,604,"14223800 COLUMBIA RIVER TRIBUTARY AT CARROLLS, WA",21,14223800,"WA",4,1.1499999999999999,51.9,69.599999999999994,81.599999999999994,96.9,109,121,133,150]
[null,null,null,null,null,null,null,null,null,null,null,null,null,null,null,null,null,605,"14224500 CLEAR FORK COWLITZ RIVER NEAR PACKWOOD, WA",21,14224500,"WA",4,55.3,1800,2850,3660,4820,5770,6810,7920,9540]
[null,null,null,null,null,null,null,null,null,null,null,null,null,null,null,null,null,606,"14225500 LAKE CREEK NEAR PACKWOOD, WA",50,14225500,"WA",4,17.59585113,430,645,801,1010,1180,1360,1550,1820]
[null,null,null,null,null,null,null,null,null,null,null,null,null,null,null,null,null,607,"14226500 COWLITZ RIVER AT PACKWOOD, WA",94,14226500,"WA",4,282.16000000000003,14200,21400,26400,33000,38100,43400,48800,56300]
[null,null,null,null,null,null,null,null,null,null,null,null,null,null,null,null,null,608,"14226800 SKATE CREEK TRIBUTARY NEAR PACKWOOD, WA",19,14226800,"WA",4,1.3,62.7,96.5,122,159,189,221,255,303]
[null,null,null,null,null,null,null,null,null,null,null,null,null,null,null,null,null,609,"14226900 SKATE CREEK TRIBUTARY NO. 2 NEAR PACKWOOD, WA",28,14226900,"WA",4,1.85,111,173,221,291,350,414,484,589]
[null,null,null,null,null,null,null,null,null,null,null,null,null,null,null,null,null,610,"14230000 JOHNSON CREEK NEAR PACKWOOD, WA",15,14230000,"WA",3,48.76,1380,2090,2600,3280,3820,4380,4970,5800]
[null,null,null,null,null,null,null,null,null,null,null,null,null,null,null,null,null,611,"14231100 MILLER CREEK AT RANDLE, WA",21,14231100,"WA",4,2.27,80.5,101,114,130,141,153,164,179]
[null,null,null,null,null,null,null,null,null,null,null,null,null,null,null,null,null,612,"14231700 CHAMBERS CREEK NEAR PACKWOOD, WA",10,14231700,"WA",4,5.7,229,301,350,414,463,514,566,639]
[null,null,null,null,null,null,null,null,null,null,null,null,null,null,null,null,null,613,"14231900 CISPUS RIVER ABOVE YELLOWJACKET CREEK NEAR RANDLE, WA",18,14231900,"WA",4,248.56,6860,11000,14000,18100,21400,24700,28200,33100]
[null,null,null,null,null,null,null,null,null,null,null,null,null,null,null,null,null,614,"14232000 YELLOWJACKET CREEK NEAR RANDLE, WA",13,14232000,"WA",4,65.819999999999993,2620,3390,3870,4440,4850,5260,5650,6160]
[null,null,null,null,null,null,null,null,null,null,null,null,null,null,null,null,null,615,"14232500 CISPUS RIVER NEAR RANDLE, WA                ",68,14232500,"WA",4,318.63721032000001,8300,12700,15900,20200,23600,27100,30800,36000]
[null,null,null,null,null,null,null,null,null,null,null,null,null,null,null,null,null,616,"14233200 QUARTZ CREEK NEAR KOSMOS, WA",11,14233200,"WA",4,1.73,90.8,124,147,177,200,224,248,282]
[null,null,null,null,null,null,null,null,null,null,null,null,null,null,null,null,null,617,"14233400 COWLITZ RIVER NEAR RANDLE, WA                ",27,14233400,"WA",4,1023.7306365000001,30300,46900,59100,75700,89000,103000,118000,139000]
[null,null,null,null,null,null,null,null,null,null,null,null,null,null,null,null,null,618,"14233500 COWLITZ RIVER NEAR KOSMOS, WA",40,14233500,"WA",4,1024.3699999999999,26500,33600,38200,43900,48100,52400,56600,62300]
[null,null,null,null,null,null,null,null,null,null,null,null,null,null,null,null,null,619,"14235000 COWLITZ RIVER AT MOSSYROCK, WA",27,14235000,"WA",4,1155.3499999999999,28200,38700,45900,55400,62800,70500,78400,89500]
[null,null,null,null,null,null,null,null,null,null,null,null,null,null,null,null,null,620,"14235300 TILTON RIVER NEAR MINERAL, WA",21,14235300,"WA",4,0.83,85.3,109,123,140,152,163,174,188]
[null,null,null,null,null,null,null,null,null,null,null,null,null,null,null,null,null,621,"14235500 WEST FORK TILTON RIVER NEAR MORTON, WA           ",29,14235500,"WA",4,16.63851618,2150,2960,3530,4290,4880,5490,6130,7030]
[null,null,null,null,null,null,null,null,null,null,null,null,null,null,null,null,null,622,"14236200 TILTON RIVER AB BEAR CANYON CREEK NEAR CINEBAR,  WA     ",58,14236200,"WA",4,139.37962896000002,10400,15800,19400,24000,27400,30800,34200,38600]
[null,null,null,null,null,null,null,null,null,null,null,null,null,null,null,null,null,623,"14236500 TILTON RIVER NEAR CINEBAR, WA",18,14236500,"WA",4,155.69,10900,15200,18100,21800,24600,27500,30500,34500]
[null,null,null,null,null,null,null,null,null,null,null,null,null,null,null,null,null,624,"14237000 KLICKITAT CREEK AT MOSSYROCK, WA",24,14237000,"WA",4,3.6,104,140,163,190,209,227,245,269]
[null,null,null,null,null,null,null,null,null,null,null,null,null,null,null,null,null,625,"14237500 WINSTON CREEK NEAR SILVER LAKE, WA             ",28,14237500,"WA",4,37.970927280000005,1200,1720,2090,2580,2970,3370,3790,4380]
[null,null,null,null,null,null,null,null,null,null,null,null,null,null,null,null,null,626,"14238000 COWLITZ RIVER BELOW MAYFIELD DAM, WA",81,14238000,"WA",4,1387.91,32800,43500,50700,59800,66700,73600,80700,90500]
[null,null,null,null,null,null,null,null,null,null,null,null,null,null,null,null,null,627,"14239000 SALMON CREEK NEAR TOLDEO, WA",18,14239000,"WA",4,77.290000000000006,3560,5510,6820,8480,9720,10900,12200,13800]
[null,null,null,null,null,null,null,null,null,null,null,null,null,null,null,null,null,628,"14239100 NORTH FORK LACAMAS CREEK NEAR ETHEL, WA",20,14239100,"WA",4,0.39,24.9,30.3,33.5,37.299999999999997,39.9,42.5,44.9,48.1]
[null,null,null,null,null,null,null,null,null,null,null,null,null,null,null,null,null,629,"14239700 OLEQUA CREEK TRIBUTARY NEAR WINLOCK, WA",20,14239700,"WA",4,0.4,22,30.8,36.9,44.7,50.7,56.8,63,71.7]
[null,null,null,null,null,null,null,null,null,null,null,null,null,null,null,null,null,630,"14240525 NF TOUTLE RIVER BLEOW SRS NEAR KID VALLEY, WA",18,14240525,"WA",4,146.31,4380,7410,9720,12910,15500,18200,21000,25100]
[null,null,null,null,null,null,null,null,null,null,null,null,null,null,null,null,null,631,"14240800 GREEN RIVER ABOVE BEAVER CREEK NEAR KID VALLEY, WA",13,14240800,"WA",4,123.47,5660,9070,11500,14700,17100,19600,22100,25600]
[null,null,null,null,null,null,null,null,null,null,null,null,null,null,null,null,null,632,"14241100 NORTH FORK TOUTLE RIVER AT KID VALLEY, WA",15,14241100,"WA",4,284.14999999999998,9600,16700,22300,30000,36300,42900,49900,60000]
[null,null,null,null,null,null,null,null,null,null,null,null,null,null,null,null,null,633,"14241500 SOUTH FORK TOUTLE RIVER AT TOUTLE, WA            ",35,14241490,"WA",4,118.37,7250,11500,14500,18500,21600,24700,28000,32500]
[null,null,null,null,null,null,null,null,null,null,null,null,null,null,null,null,null,634,"14241490 SOUTH FORK TOUTLE RIVER AT CAMP 12 NEAR TOUTLE, WA",16,14241500,"WA",4,119.64706181999999,7200,10000,11900,14400,16200,18000,19800,22300]
[null,null,null,null,null,null,null,null,null,null,null,null,null,null,null,null,null,635,"14242500 TOUTLE RIVER NEAR SILVER LAKE, WA              ",57,14242500,"WA",4,477.53736030000005,17200,23700,28200,34300,39100,44200,49400,56900]
[null,null,null,null,null,null,null,null,null,null,null,null,null,null,null,null,null,636,"14242580 TOUTLE RIVER AT TOWER ROAD NEAR SILVER LAKE, WA       ",32,14242580,"WA",4,498.93038910000001,20400,31800,39700,49800,57500,65100,72800,83300]
[null,null,null,null,null,null,null,null,null,null,null,null,null,null,null,null,null,637,"14242600 TOUTLE RIVER TRIBUTARY NEAR CASTLE ROCK, WA",21,14242600,"WA",4,0.7,39.4,60.2,75.099999999999994,95.3,111,128,145,169]
[null,null,null,null,null,null,null,null,null,null,null,null,null,null,null,null,null,638,"14243000 COWLITZ RIVER AT CASTLE ROCK, WA",88,14243000,"WA",4,2229.58,51500,68500,79600,93400,104000,114000,124000,138000]
[null,null,null,null,null,null,null,null,null,null,null,null,null,null,null,null,null,639,"14243500 DELAMETER CREEK NEAR CASTLE ROCK, WA",21,14243500,"WA",4,19.66,1320,1920,2330,2880,3300,3730,4170,4780]
[null,null,null,null,null,null,null,null,null,null,null,null,null,null,null,null,null,640,"14245000 COWEMAN RIVER NEAR KELSO, WA                ",36,14245000,"WA",4,118.14972741000001,5020,6820,8060,9680,10900,12200,13500,15400]
[null,null,null,null,null,null,null,null,null,null,null,null,null,null,null,null,null,642,"14247500 ELOCHOMAN RIVER NEAR CATHLAMET, WA             ",39,14247500,"WA",4,65.740243140000004,4920,6430,7380,8530,9350,10200,10900,12000]
[null,null,null,null,null,null,null,null,null,null,null,null,null,null,null,null,null,643,"14248100 RISK CREEK NEAR SKAMOKAWA, WA",22,14248100,"WA",4,1.17,85.2,120,143,171,191,211,231,258]
[null,null,null,null,null,null,null,null,null,null,null,null,null,null,null,null,null,644,"14248200 JIM CROW CREEK NEAR GRAYS RIVER, WA",15,14248200,"WA",4,5.48,557,774,918,1100,1240,1370,1510,1690]
[null,null,null,null,null,null,null,null,null,null,null,null,null,null,null,null,null,647,"14249000 GRAYS RIVER ABOVE SOUTH FORK NEAR GRAYS RIVER, WA",24,14249000,"WA",4,39.71,5380,7160,8280,9620,10600,11500,12400,13600]
[null,null,null,null,null,null,null,null,null,null,null,null,null,null,null,null,null,648,"14250500 WEST FORK GRAYS RIVER NEAR GRAYS RIVER, WA",21,14250500,"WA",4,15.53,2440,3250,3800,4490,5020,5550,6090,6820]