{"text_format":"1","workbook":"xlsx","n_sheets":6,"sheets":["Explanation","GeoCOLUMN","Lith_HSU_Chart","HSU","ConsWL","CONTROL"],"not_rendered":{"charts":2,"images":4,"macros":1,"external_links":0,"defined_names":19,"comments":0,"pivot_tables":0},"unopened":[],"bounds":{"document_bytes":16777216,"sheet_cells":100000,"rows_first":2000,"rows_last":500,"rows_between":2000,"halvings":0,"cell_chars":16384,"cell_head_chars":4096},"cells_cut":0,"cells_raw":0,"read":"whole","date_system":"1900"}

{"sheet":"Explanation","index":0,"n_rows":48,"n_cols":1,"rows_kept":48,"cut":false,"hidden":false,"merged":[]}
["Appendix 3. Hydrostratigraphic units for wells and underground nuclear test holes in the Pahute Mesa–Oasis Valley groundwater basin, as determined from well logs and projected from hydrostratigraphic framework models."]
[]
["This workbook contains hydrostratigraphic well logs supporting the following U.S. Geological Survey Scientific Investigations report:"]
["Jackson, T.R., Fenelon, J.M., and Paylor, R.L., 2021, Groundwater flow conceptualization of the Pahute Mesa–Oasis Valley Groundwater Basin, Nevada—A synthesis of geologic, hydrologic, hydraulic-property, and tritium data: U.S. Geological Survey Scientific Investigations Report 2020–5134, 100 p., https://doi.org/ 10.3133/ sir20205134."]
[]
["This workbook contains well logs for wells in the Pahute Mesa–Oasis Valley (PMOV) groundwater basin that had water levels used for water-level contouring. There are five worksheets in this Excel workbook, in addition to this \"Explanation\" worksheet. The primary worksheet is \"GeoCOLUMN\", which contains an interface that allows the user to select a well and obtain the hydrostratigraphic units (HSUs) and hydrogeologic units (HGUs) encountered at the well site. \"Lith_HSU_Chart\" is a worksheet containing descriptions of all the HSUs used in this workbook and their general lithologic characters. \"HSU\" and \"ConsWL\" contain HSU, well-construction, and water-level data that are used by \"GeoCOLUMN\". The \"CONTROL\" tab provides information for the Excel Macros to allow them to generate the well logs on the \"GeoCOLUMN\" sheet."]
[]
["HSU data for each well or test hole in this appendix were derived from records documented in two references:\n\nU.S. Department of Energy, 2020a, Pahute Mesa-Oasis Valley hydrostratigraphic framework model for Corrective Action Units 101 and 102--Central and western Pahute Mesa, Nye County, Nevada: U.S. Department of Energy Report DOE/EMNV--0014, 708 p.\n\nNational Security Technologies, LLC, 2007, A hydrostratigraphic model and alternatives for the groundwater flow and contaminant transport model of Corrective Action Unit 99—Rainier Mesa–Shoshone Mountain, Nye County, Nevada: U.S. Department of Energy Report DOE/NV/25946—146, 302 p. \n\nRecords for each well include: (1) the HSUs and their top and bottom altitudes, based on well-log data; and (2) HSUs and their top and bottom altitudes based on a projection of the well through a hydrostratigraphic framework model of the Pahute Mesa–Oasis Valley groundwater basin (U.S. Department of Energy, 2020) or Rainier Mesa–Shoshone Mountain area (National Security Technologies, LLC, 2007). The HSUs reported in this workbook to the bottom of the drilled well are consistent with the original lithologic log. At depths below the bottom of the well, the predicted HSUs are based on interpretations from hydrostratigraphic framework models. Worksheet \"GeoCOLUMN\" provides a generalized stratigraphic column of the HSUs. Worksheet \"HSU\" contains the HSUs interpreted at each well and the data source that was used to make the interpretation, which is listed under the column header \"HSUDescription\". Entries under \"HSUDescription\" that say \"LOG\" or \"UGTA log\" indicate that the interpreted HSU for that row was derived from a well log rather than an interpretation from a hydrostratigraphic framework model."]
[]
["Column headings and instructions for viewing worksheet \"GeoCOLUMN\""]
["Well Name: USGS well name or nuclear test hole name. For test holes, name of nuclear test detonation is in brackets [ ]. Use pull-down feature to select well or test hole to be displayed."]
["Maximum altitude: Maximum altitude of data that will be shown on well-log plot. This value can be changed to the user's preference by typing in a different value. Altitude referenced to NGVD 29."]
["Minimum altitude: Minimum altitude of data that will be shown on well-log plot. This value can be changed to the user's preference by typing in a different value. Altitude referenced to NGVD 29."]
["Units: Displays the units of altitude used on the well-log plot. Click on the drop-down menu in the cell to toggle between different units."]
["HSU name: Name of HSU encountered at well site, as derived from well logs or projected from framework model. Descriptions of HSUs are provided in the worksheet \"Lith_HSU_Chart\"."]
["HSU top altitude: The altitude of the top of the HSU that is labeled in column to the left and shown on well-log plot. Altitude referenced to NGVD 29."]
["Altitude: Altitudes of (1) land surface (LSD) at the well site; (2) water level in the well (Water Lev); (3) top of the uppermost well opening (Open Top); and (4) bottom of the lowermost opening (Open Bot). Altitudes referenced to NGVD 29."]
["Map Note: Index map of the Pahute Mesa–Oasis Valley groundwater basin. Wells and underground nuclear test holes are shown as black dots; selected well or hole is shown as large yellow circle."]
["The features on the well-log plot in \"GeoCOLUMN\" are as follows: \n    The well-log plot is shown on the left side of  the \"GeoCOLUMN\" worksheet. The colors on the well log are based on hydrogeologic units described to the lower right of the plot; corresponding HSUs are described to the upper right of the plot. If all the HSUs listed to the right of the plot do not show up on the well-log plot, then change the \"Minimum altitude\" and/or \"Maximum altitude\" on the upper part of the worksheet to a lower and/or higher value, respectively. Then click the \"Refresh\" button.\n    On the left side of the well log is a vertical line with upper and lower blue tick marks, indicating the altitude of land surface and the bottom of the hole, respectively.\n    On the right side of the well log is another vertical line with upper and lower blue tick marks, indicating the altitude of top of uppermost well opening and bottom of lowermost opening.\n    A thin horizontal line across the well log with an inverted light-blue triangle on it indicates the mean predevelopment water level in the well:\n         If the triangle has a dark-blue arrow pointing up, then the water level is considered to be \"greater than or equal to\" the value indicated; \n         If the triangle has a dark-blue arrow pointing down, then the water level is considered to be \"less than or equal to\" the value indicated;\n         If the triangle has dark-blue arrows pointing up and down, then the water level is considered to be bounded between two values given in the column \"WLAtlAveFt\" in the worksheet \"ConsWL\" and,\n         If the triangle has an \"e\" above it, then the water level was not measured and is an estimate that approximates (+/- 50 ft) the predevelopment water level.\n   An orange-red explosion symbol in the center of the well log indicates the depth of a nuclear test that was detonated in the hole. The name of the detonation is in brackets following the hole name."]
["Batch plot feature\n    A macro is available to batch process GIF files of the well log columns for all wells in the spreadsheet. The macro is initiated by entering ALT-F8 or using the EXCEL tools pull down menu and selecting the \"Macro\" option and running the \"BurpGIFS\" macro. A set of GIF files, identified by well name, is created in the parent directory. "]
[]
["Column headings for worksheet \"HSU\""]
["Site_NO: Unique, 15-digit, U.S. Geological Survey site identification number."]
["WellID: U.S. Geological Survey well name or nuclear test hole name. For test holes, name of nuclear test detonation is given in brackets [ ] after hole name."]
["HSUTopAltM: Altitude of the top of the reference hydrostratigraphic unit, in meters. Altitude reference is NGVD 29."]
["HSU: Reference hydrostratigraphic unit."]
["HSUBotAltM: Altitude of the bottom of the reference hydrostratigraphic unit, in meters. Altitude reference is NGVD 29."]
["HSUThickM: Thickness of the reference hydrostratigraphic unit, in meters."]
["HSUDescription: Name of hydrostratigraphic framework model or reference source from which data are derived: PMOV, Pahute Mesa–Oasis Valley framework model; Interp, Interpreted from nearby PMOV model; Log, Geologic log; RMSM, Rainier Mesa–Shoshone Mountain framework model; UGTA log, Geologic and geopysical log interpretations made by geologists as part of the Underground Test Area (UGTA) activity (U.S. Department of Energy, 2020) "]
[]
{"$rows_left_out":19}
{"sheet":"GeoCOLUMN","index":1,"n_rows":41,"n_cols":10,"rows_kept":41,"cut":false,"hidden":false,"merged":[[33,8,34,10],[35,8,36,10],[37,8,38,10],[39,8,40,10],[31,8,32,10],[27,8,28,10],[23,8,24,10],[29,8,30,10],[6,7,6,9],[20,7,20,10],[25,8,26,10],[21,8,22,10]]}
["UPPERcorner",null,null,null,null,"Well Name:","ER-20-12 p4"]
[]
[null,null,null,null,null,"Maximum Altitude:",7500]
[null,null,null,null,null,"Minimum Altitude:",0]
[null,null,null,null,null,"Units:","ft"]
[]
[null,null,null,null,null,"HSU Name",{"$f":"\"HSU top altitude\"&\", \"&depthUNIT","v":"HSU top altitude, ft"},{"$f":"(CONTROL!I3&\", \"&depthUNIT)","v":"Altitude, ft"}]
[null,null,null,null,null,"TCVA",{"$f":"depCONV*CONTROL!I4","v":6257.8740157480315},"LSD:",null,{"$f":"CONTROL!M7","v":6258}]
[null,null,null,null,null,"TMWTA",{"$f":"depCONV*CONTROL!I5","v":5362.8740443880306},"Water Lev:",{"$f":"CONTROL!L15","v":""},{"$f":"CONTROL!M13","v":4647}]
[null,null,null,null,null,"TMLVTA",{"$f":"depCONV*CONTROL!I6","v":4442.8740738280294},"Open Top:",null,{"$f":"CONTROL!M10","v":6196}]
[null,null,null,null,null,"UPCU",{"$f":"depCONV*CONTROL!I7","v":3877.8740919080287},"Open Bot:",null,{"$f":"CONTROL!M11","v":3971}]
[null,null,null,null,null,"CHLFA5",{"$f":"depCONV*CONTROL!I8","v":3762.8740955880285}]
[null,null,null,null,null,"CHZCM",{"$f":"depCONV*CONTROL!I9","v":3402.2309711286084}]
[null,null,null,null,null,"BRA",{"$f":"depCONV*CONTROL!I10","v":2855.8741246120285}]
[null,null,null,null,null,"PBRCM",{"$f":"depCONV*CONTROL!I11","v":2464.8741371240276}]
[null,null,null,null,null,"LCA",{"$f":"depCONV*CONTROL!I12","v":208.73568568045792}]
[null,null,null,null,null,"LCCU",{"$f":"depCONV*CONTROL!I13","v":-8673.9381988339774}]
[null,null,null,null,null,"NO DATA",{"$f":"depCONV*CONTROL!I14","v":-9842.5196850393695}]
[]
[]
[null,null,null,null,null,null,null,"Hydrogeologic color code"]
[null,null,null,null,null,null,null,null,"Alluvial aquifer"]
[]
[null,null,null,null,null,null,null,null,"Vitric-tuff aquifer (VTA)"]
[]
[null,null,null,null,null,null,null,null,"Welded-tuff aquifer (WTA)"]
[]
[null,null,null,null,null,null,null,null,"Lava-flow aquifer (LFA)"]
[]
[null,null,null,null,null,null,null,null,"Lava-flow and welded-tuff aquifers"]
{"$rows_left_out":12}
{"sheet":"Lith_HSU_Chart","index":2,"n_rows":88,"n_cols":5,"rows_kept":88,"cut":false,"hidden":false,"merged":[[0,0,0,4]]}
["Hydrostratigraphic units in the Pahute Mesa–Oasis Valley groundwater basin, Nevada."]
[]
["General lithologic grouping","Hydrostratigraphic unit1","Applicable framework models"," Description of hydrostratigraphic unit1","Primary lithology of hydrostratigraphic unit1"]
["Alluvium, coarse","AA","PMOV, RMSM","Alluvial aquifer","Alluvium: gravelly sand, colluvium, and moat-filling sediments near Timber Mountain"]
["Volcanic composite","YVCM","PMOV","Younger volcanic composite unit","Basaltic rocks and some welded and nonwelded ash-flow tuffs"]
["Welded tuff and lava","TCVA","PMOV","Thirsty Canyon volcanic aquifer","Welded ash-flow tuff and lava"]
["Volcanic composite","DVCM","PMOV","Detached Volcanics Composite Unit","Welded and nonwelded ash-flow tuffs and lava"]
["Welded tuff and lava","DVA","PMOV","Detached Volcanics Aquifer","Welded ash-flow tuff and lava"]
["Nonwelded/bedded tuff","FCCM","PMOV, RMSM","Fortymile Canyon composite unit","Lava and lesser ash-flow and bedded tuffs"]
["Lava","FCUMLFA","PMOV","Fortymile Canyon Upper Mafic Lava Flow Aquifer","Basaltic lava"]
["Lava","FCULFA1","PMOV","Fortymile Canyon Upper Lava Flow Aquifer 1","Rhyolitic lava"]
["Lava","FCULFA2","PMOV","Fortymile Canyon Upper Lava Flow Aquifer 2","Rhyolitic lava"]
["Lava","FCULFA3","PMOV","Fortymile Canyon Upper Lava Flow Aquifer 3","Rhyolitic lava"]
["Lava","FCULFA4","PMOV","Fortymile Canyon Upper Lava Flow Aquifer 4","Rhyolitic lava"]
["Lava","FCULFA5","PMOV","Fortymile Canyon Upper Lava Flow Aquifer 5","Rhyolitic lava"]
["Lava","FCULFA6","PMOV","Fortymile Canyon Upper Lava Flow Aquifer 6","Rhyolitic lava"]
["Lava","FCULFA7","PMOV","Fortymile Canyon Upper Lava Flow Aquifer 7","Rhyolitic lava"]
["Welded tuff","FCWTA1","PMOV","Fortymile Canyon Welded Tuff Aquifer 1","Welded ash-flow tuff"]
["Welded tuff","FCWTA","PMOV","Fortymile Canyon Welded Tuff Aquifer","Welded ash-flow tuff"]
["Lava","FCLLFA","PMOV","Fortymile Canyon Lower Lava Flow Aquifer","Rhyolitic lava"]
["Volcanic composite","THCM","PMOV","Tannenbaum Hill Composite Unit","Hydrothermally altered tuffs and lavas and unaltered welded tuff with lesser lava"]
["Lava","FCLMLFA","PMOV","Fortymile Canyon Lower Mafic Lava Flow Aquifer ","Basaltic lava"]
["Welded tuff","BWWTA","PMOV","Buttonhook Wash Welded Tuff Aquifer ","Welded ash-flow tuff"]
["Nonwelded/bedded tuff","BWCU","PMOV","Buttonhook Wash Confining Unit","Nonwelded, bedded, and reworked tuffs"]
["Welded tuff","ATWTA","PMOV","Ammonia Tanks Welded Tuff Aquifer ","Welded ash-flow tuff"]
["Nonwelded/bedded tuff","ATCCU","PMOV","Ammonia Tanks Caldera Confining Unit","Nonwelded, bedded, and reworked tuffs"]
["Nonwelded/bedded tuff","THCU","PMOV","Tannenbaum Hill Confining Unit","Nonwelded, bedded, and reworked tuffs"]
["Welded tuff","RMWTA","PMOV, RMSM","Rainier Mesa Welded Tuff Aquifer ","Welded ash-flow tuff"]
["Welded tuff","TMUWTA","PMOV","Timber Mountain Upper Welded Tuff Aquifer","Welded ash-flow tuff"]
["Lava","THLFA","PMOV","Tannenbaum Hill Lava Flow Aquifer","Rhyolitic lava"]
{"$rows_left_out":59}
{"sheet":"HSU","index":3,"n_rows":4644,"n_cols":7,"rows_kept":4644,"cut":false,"hidden":false,"merged":[]}
["SITE_NO","WellID","HSUTopAltM","HSU","HSUBotAltM","HSUThickM","HSUDescription"]
["365619116483901","Beatty Middle Well",1252.73,"AA",1228.3399999999999,24.3900000000001,"Log"]
["365619116483901","Beatty Middle Well",1228.3399999999999,"DVCM",161.89899999999989,1066.441,"PMOV"]
["365619116483901","Beatty Middle Well",161.89899999999989,"LCCU",-3000,3161.8989999999999,"PMOV"]
["365619116483901","Beatty Middle Well",-3000,"NO DATA","",""]
["365527116475301","Beatty Summit Well",1183.23,"AA",1161.9000000000001,21.329999999999927,"Log"]
["365527116475301","Beatty Summit Well",1161.9000000000001,"DVCM",218.83100000000013,943.06899999999996,"PMOV"]
["365527116475301","Beatty Summit Well",218.83100000000013,"LCCU",-3000,3218.8310000000001,"PMOV"]
["365527116475301","Beatty Summit Well",-3000,"NO DATA","",""]
["365709116481101","Beatty Upper Indian Well",1292.3499999999999,"DVCM",293.81299999999987,998.53700000000003,"PMOV"]
["365709116481101","Beatty Upper Indian Well",293.81299999999987,"LCCU",-3000,3293.8130000000001,"PMOV"]
["365709116481101","Beatty Upper Indian Well",-3000,"NO DATA","",""]
["365640116431501","Beatty Wash Terrace Well",1051.5999999999999,"AA",1030.9399999999998,20.660000000000082,"Log"]
["365640116431501","Beatty Wash Terrace Well",1030.9399999999998,"DVCM",-322.63800000000015,1353.578,"PMOV"]
["365640116431501","Beatty Wash Terrace Well",-322.63800000000015,"LCA",-372.68600000000015,50.048000000000002,"PMOV"]
["365640116431501","Beatty Wash Terrace Well",-372.68600000000015,"LCCU",-3000,2627.3139999999999,"PMOV"]
["365640116431501","Beatty Wash Terrace Well",-3000,"NO DATA","",""]
["370014116332501","Beatty Wash Windmill Well",1338.1,"AA",1283.8779999999999,54.22199999999998,"Log"]
["370014116332501","Beatty Wash Windmill Well",1283.8779999999999,"ATWTA",1244.54,39.337999999999965,"PMOV"]
["370014116332501","Beatty Wash Windmill Well",1244.54,"THCU",1201.395,43.144999999999982,"PMOV"]
["370014116332501","Beatty Wash Windmill Well",1201.395,"RMWTA",282.96499999999992,918.43000000000006,"PMOV"]
["370014116332501","Beatty Wash Windmill Well",282.96499999999992,"SCVCU",-140.09300000000007,423.05799999999999,"PMOV"]
["370014116332501","Beatty Wash Windmill Well",-140.09300000000007,"RMICU",-2212.5119999999997,2072.4189999999999,"PMOV"]
["370014116332501","Beatty Wash Windmill Well",-2212.5119999999997,"ATICU",-3000,787.48800000000028,"PMOV"]
["370014116332501","Beatty Wash Windmill Well",-3000,"NO DATA","",""]
["365457116515801","Beatty Water Test Hole",1025.7,"AA",973.572,52.128000000000043,"Log"]
["365457116515801","Beatty Water Test Hole",973.572,"DVCM",277.20699999999999,696.36500000000001,"PMOV"]
["365457116515801","Beatty Water Test Hole",277.20699999999999,"LCCU",-3000,3277.2069999999999,"PMOV"]
["365457116515801","Beatty Water Test Hole",-3000,"NO DATA","",""]
["365524116444001","Beatty Well No. 1",1025.7,"AA",976.35100000000011,49.348999999999933,"Log"]
{"$rows_left_out":4615}
{"sheet":"ConsWL","index":4,"n_rows":410,"n_cols":15,"rows_kept":410,"cut":false,"hidden":false,"merged":[]}
["SiteID","WellID","Lat83","Long83","LSAltFt","HoleBotAltFT","WLAltAveFt","Qualifier","WLaltAveFtNoQ","OpenTopFt","OpenBotFt","DetNAMENV209","DBFt","DBAltFt","Yld"]
["365619116483901","Beatty Middle Well",36.9396664183867,-116.81339454200101,4110,3410,"4061","",4061,4010,3410,"",9999,null,""]
["365527116475301","Beatty Summit Well",36.924389163469201,-116.799782960355,3882,3182,"3752","",3752,3817,3182,"",9999,null,""]
["365709116481101","Beatty Upper Indian Well",36.951610705702002,-116.80422799199501,4240,3547,"4063","",4063,4185,3547,"",9999,null,""]
["365640116431501","Beatty Wash Terrace Well",36.944389788428097,-116.721726558637,3450,3375,"ge3431","ge",3431,3400,3375,"",9999,null,""]
["370014116332501","Beatty Wash Windmill Well",37.003999530391297,-116.55803213815599,4390,3910,"4052","",4052,4390,3910,"",9999,null,""]
["365457116515801","Beatty Water Test Hole",36.9157787028713,-116.761448951227,3365,3190,"3285","",3285,3365,3190,"",9999,null,""]
["365524116444001","Beatty Well No. 1",36.915500937573299,-116.760893382603,3365,3165,"3270","",3270,3315,3165,"",9999,null,""]
["365409116452301","Beatty Well No. 2",36.906334491033498,-116.758670941811,3300,3105,"3280","",3280,3230,3105,"",9999,null,""]
["365420116453001","Beatty Well No. 3",36.904945641018898,-116.757837568555,3290,2990,"3274","",3274,3220,2990,"",9999,null,""]
["365358116452001","BGC-1 Well",36.899390218278903,-116.756448545938,3270,3195,"3254","",3254,3270,3195,"",9999,null,""]
["365355116451401","BGC-2 Well",36.898556921073499,-116.75478183922201,3261,3186,"3250","",3250,3243,3186,"",9999,null,""]
["370648116473001","BLM Springdale",37.113550944716899,-116.79312019872,4035,3918,"3941","",3941,4035,3918,"",9999,null,""]
["365934116431601","Boiling Pot Rd Well",36.9927221290869,-116.72200528814901,3620,3608,"3618","",3618,3616,3608,"",9999,null,""]
["365239116490701","CDH-61",36.877445586709499,-116.819504544976,3331,2331,"2650","",2650,3281,2331,"",9999,null,""]
["365322116493701","CDH-72",36.889389659999999,-116.8278382,3531,2731,"3064","",3064,3481,2731,null,9999]
["365431116452501","Central Beatty Well",36.908556675895802,-116.757837643144,3300,3273,"3287","",3287,3300,3276,"",9999,null,""]
["365520116370301","Crater Flat 1 (CF-1)",36.920780739150999,-116.616168382346,3931,2331,"3314","",3314,3131,2331,"",9999,null,""]
["365445116383901","Crater Flat 1a (CF-1a)",36.911613810267099,-116.645613280429,4081,3381,"3946","",3946,3873,3381,"",9999,null,""]
["371106116110401","ER-12-1 (1641-1846 ft)",37.1848564622087,-116.185093245535,5817,2229,"4293","",4293,4176,3971,"",9999,null,""]
["371106116110407","ER-12-1 (1641-3414 ft)",37.1848564622087,-116.185093245535,5817,2229,"4274","",4274,4176,2375,"",9999,null,""]
["371106116110405","ER-12-1 (1883-1940 ft)",37.1848564622087,-116.185093245535,5817,2229,"4337","",4337,3934,3857,"",9999,null,""]
["371106116110404","ER-12-1 (2449-2602 ft)",37.1848564622087,-116.185093245535,5817,2229,"4383","",4383,3368,3215,"",9999,null,""]
["371106116110403","ER-12-1 (2958-3212 ft)",37.1848564622087,-116.185093245535,5817,2229,"3038","",3038,2859,2605,"",9999,null,""]
["371106116110402","ER-12-1 (3309-3414 ft)",37.1848564622087,-116.185093245535,5817,2229,"3055","",3055,2508,2375,"",9999,null,""]
["371106116110406","ER-12-1 (brhl)",37.1848564622087,-116.185093245535,5817,2229,"4272","",4272,4343,2229,"",9999,null,""]
["371142116125102","ER-12-3 main",37.194967166763099,-116.21499181344799,7391,2483,"4282","",4282,4944,2483,"",9999,null,""]
["371142116125101","ER-12-3 piezometer",37.194967166763099,-116.21499181344799,7391,2483,"6147","",6147,7336,5181,"",9999,null,""]
["371311116105902","ER-12-4 main",37.219578577910198,-116.184024015435,6884,3169,"4319","",4319,4383,3169,"",9999,null,""]
["371311116105901","ER-12-4 piezometer",37.219578577910198,-116.184024015435,6884,3169,"5936",null,5936,6828,4896,"",9999,null,""]
{"$rows_left_out":381}
{"sheet":"CONTROL","index":5,"n_rows":84,"n_cols":17,"rows_kept":84,"cut":false,"hidden":false,"merged":[]}
[null,null,null,null,"Honest Hydrogeologic Units",null,null,null,null,null,"Row now = ",{"$f":"MATCH(SiteNOW,pickWELL,0)","v":56},null,null,null,null,{"$f":"GeoCOLUMN!H7&CHAR(10)&GeoCOLUMN!H8&TEXT(GeoCOLUMN!J8,\"#,##0\")&CHAR(10)&GeoCOLUMN!H9&TEXT(GeoCOLUMN!J9,\"#,##0\")&CHAR(10)&GeoCOLUMN!H10&TEXT(GeoCOLUMN!J10,\"#,##0\")&CHAR(10)&GeoCOLUMN!H11&TEXT(GeoCOLUMN!J11,\"#,##0\")","v":"Altitude, ft\nLSD:6,258\nWater Lev:4,647\nOpen Top:6,196\nOpen Bot:3,971"}]
["Native HSU units:","m",null,null,null,null,null,null,null,null,null,null,null,"Native WELL units:","ft"]
["Convert:",{"$f":"OFFSET($B$4,MATCH(depthUNIT,pickLEN,0),0)/OFFSET($B$4,MATCH($B$2,pickLEN,0),0)","v":3.280839895013123},{"$f":"depthUNIT&\" / \"&B2","v":"ft / m"},null,"HSUTop","ROW",null,"HSUTopInWell","Altitude",null,"Lat83","Long83",null,"Convert:",{"$f":"OFFSET($B$4,MATCH(depthUNIT,pickLEN,0),0)/OFFSET($B$4,MATCH($O$2,pickLEN,0),0)","v":1},{"$f":"depthUNIT&\" / \"&O2","v":"ft / ft"}]
[null,null,null,null,"AA",null,null,"TCVA",1907.4,null,{"$f":"OFFSET(ConsWL!$A$1,$L$1,MATCH(K3,ConsWL!$B$1:$O$1,0))","v":37.280876999999997},{"$f":"OFFSET(ConsWL!$A$1,$L$1,MATCH(L3,ConsWL!$B$1:$O$1,0))","v":-116.53939699999999}]
["m",1,null,null,"YVCM",null,null,"TMWTA",1634.6040087294718]
["ft",{"$f":"1/0.3048","v":3.280839895013123},null,null,"TCVA",null,null,"TMLVTA",1354.1880177027836,null,null,"x","Y","BAR-MINUS","BAR-PLUS"]
["mi",{"$f":"B6/5280","v":6.2137119223733392E-4},null,null,"DVCM",null,null,"UPCU",1181.9760232135673,null,"LSAltFt",0.1,{"$f":"OFFSET(ConsWL!$A$1,$L$1,MATCH(K7,ConsWL!$B$1:$O$1,0))*depCONwell","v":6258},{"$f":"L7","v":0.1},0]
["km",{"$f":"B5/1000","v":1E-3},null,null,"DVA",null,null,"CHLFA5",1146.9240243352313,null,"HoleBotAltFt",{"$f":"L7","v":0.1},{"$f":"OFFSET(ConsWL!$A$1,$L$1,MATCH(K8,ConsWL!$B$1:$O$1,0))*depCONwell","v":1715},{"$f":"N7","v":0.1},{"$f":"O7","v":0}]
[null,null,null,null,"FCCM",null,null,"CHZCM",1037,null,null,{"$f":"L8","v":0.1}]
[null,null,null,null,"FCUMLFA",null,null,"BRA",870.47043318174633,null,"OpenTopFt",{"$f":"1-L7","v":0.9},{"$f":"OFFSET(ConsWL!$A$1,$L$1,MATCH(K10,ConsWL!$B$1:$O$1,0))*depCONwell","v":6196},{"$f":"-N7","v":-0.1},{"$f":"-O7","v":0}]
[null,null,null,null,"FCULFA1",null,null,"PBRCM",751.29363699540363,null,"OpenBotFt",{"$f":"L10","v":0.9},{"$f":"OFFSET(ConsWL!$A$1,$L$1,MATCH(K11,ConsWL!$B$1:$O$1,0))*depCONwell","v":3971},{"$f":"-N8","v":-0.1},{"$f":"-O8","v":0}]
[null,null,null,null,"FCULFA2",null,null,"LCA",63.622636995403582,null,null,{"$f":"L11","v":0.9}]
[null,null,null,null,"FCULFA3",null,null,"LCCU",-2643.8163630045965,null,"WLaltAveFtNoQ",0.6,{"$f":"OFFSET(ConsWL!$A$1,$L$1,MATCH(K13,ConsWL!$B$1:$O$1,0))*depCONwell","v":4647},{"$f":"L13-N7","v":0.5},{"$f":"N13","v":0.5}]
[null,null,null,null,"FCULFA4",null,null,"NO DATA",-3000]
[null,null,null,null,"FCULFA5",null,null,null,null,null,"Qualifier",{"$f":"OFFSET(ConsWL!$A$1,$L$1,MATCH(K15,ConsWL!$B$1:$O$1,0))","v":""}]
[null,null,null,null,"FCULFA6"]
[null,null,null,null,"FCULFA7"]
[null,null,null,null,"FCWTA1"]
[null,null,null,null,"FCWTA"]
[null,null,null,null,"FCLLFA"]
[null,null,null,null,"THCM"]
[null,null,null,null,"FCLMLFA",null,null,null,null,null,"DetNameNV209","x",{"$f":"OFFSET(ConsWL!$A$1,$L$1,MATCH(K22,ConsWL!$B$1:$O$1,0))","v":0}]
[null,null,null,null,"BWWTA",null,null,null,null,null,"DBAltFt",0.5,{"$f":"OFFSET(ConsWL!$A$1,$L$1,MATCH(K23,ConsWL!$B$1:$O$1,0))*depCONwell","v":0}]
[null,null,null,null,"BWCU"]
[null,null,null,null,"ATWTA"]
[null,null,null,null,"ATCCU"]
[null,null,null,null,"THCU"]
[null,null,null,null,"RMWTA"]
[null,null,null,null,"TMUWTA"]
[null,null,null,null,"THLFA"]
{"$rows_left_out":54}